{"text_format":"3","workbook":"xlsx","n_sheets":16,"sheets":["Deckblatt","Legende","Produkt-Grenzen,Layout,Info's","Abnahmeprotokoll","Alle","1.Verpacken","2.Lagerung","3.Transport","4.Installation","5.Inbetriebnahme","6.Betrieb","7.Außerbetriebnahme","8.Reinigung","9.Wartung","10.Störungsbeseitigung","11.Entsorgung"],"not_rendered":{"images":2,"external_links":5,"defined_names":374},"read":"whole","date_system":"1900"}

{"sheet":"Deckblatt","index":0,"n_rows":36,"n_cols":5,"rows_kept":36,"merged":[[0,1,4,2],[2,4,2,5],[3,4,3,5],[5,2,5,5],[6,1,10,1],[6,3,6,5],[7,3,7,5],[8,3,8,5],[9,3,9,5],[11,2,11,5],[12,1,21,1],[12,3,12,5],[13,3,13,5],[14,3,14,5],[15,3,15,5],[16,3,16,5],[17,3,17,5],[18,3,18,5],[19,3,19,5],[20,3,20,5],[22,2,22,5],[23,1,27,1],[23,3,23,5],[24,3,24,5],[25,3,25,5],[26,3,26,5],[27,3,27,5],[28,3,28,5],[29,3,29,5]]}
[]
[]
[{"$nulls":4},"Datum:"]
[]
[]
[null,"Allgemeine Daten"]
[null,null,"Projektname"]
[null,null,"Müller Modell-Nr"]
[null,null,"Müllernummer "]
[null,null,"Funktion"]
[]
[null,"Technische Daten"]
[null,null,"Geschwindigkeit"]
[null,null,"Papierlauf Höhe von Boden (mm)"]
[null,null,"Pneumatik"]
[null,null,"Elektrische Versorgung"]
[null,null,"Grammaturen"]
[null,null,"Formate"]
[null,null,"Parallelverarbeitung möglich\n (1-up,2up…)"]
[null,null,"Gewicht (kg)"]
[null,null,"Abmaße LxBxH (mm)"]
[]
[null,"Verantwortliche"]
[null,null,"Projektleiter*in"]
[null,null,"Konstruktion"]
[null,null,"Elektrik "]
[null,null,"Software "]
[null,null,"Dokumentation"]
[null,null,"Entwicklungsleitung"]
[null,null,"Verpackung / Lager / Transport"]
[]
[null,null,"Dateiname:",{"$f":"MID(CELL(\"Dateiname\",A1),SEARCH(\"[\",CELL(\"Dateiname\",A1),1)+1,SEARCH(\"]\",CELL(\"Dateiname\",A1),1)-SEARCH(\"[\",CELL(\"Dateiname\",A1),1)-1)","v":"Risikobeurteilung_Template.xlsx"}]
[]
[null,null,"Hinweis: Die Risikobewertung wurde unter dem Aspekt durchgeführt, dass Risiken sowohl auf Herstellerseite als auch auf Betreiberseite bewertet und Maßnahmen abgeleitet wurden. "]
[null,null,"SA = Service Anleitung"]
[null,null,"BA = Betriebsanleitung"]

{"sheet":"Legende","index":1,"n_rows":56,"n_cols":20,"rows_kept":56,"merged":[[0,1,0,4],[0,7,0,13],[2,7,2,8],[6,7,6,8],[10,7,10,8],[20,1,20,19],[40,1,40,19]]}
[null,"Begriffsdefinitionen",{"$nulls":5},"Risikograph nach DIN 13849"]
[]
[null,"Lebensphase der Maschine",null,"Art der Gefährdung","Nr",null,null,"Schwere der Verletzung"]
[{"$nulls":7},"Leichte (reversible Verletzung)","S1"]
[null,"A-Alle",{"$nulls":5},"Schwere (irreversible Verletzung/Tod)","S2"]
[null,"1. Verpacken",null,"Mechanische_Gefährdung","A"]
[null,"2. Lagerung",null,"Elektrische_Gefährdung","B",null,null,"Häufigkeit und Dauer"]
[null,"3 Transport innerbetrieblich\n   Transport außerbetrieblich",null,"Thermische_Gefährdungen","CE",null,null,"Selten oder kurze Gefährdung","F1"]
[null,"4. Installation",null,"Gefährdungen_durch_Lärm","D",null,null,"Häufig (>1/h)","F2"]
[null,"5. Inbetriebnahme",null,"Gefährdungen_durch_Vibration","E"]
[null,"6.Betrieb",null,"Gefährdungen_durch_Strahlung","F",null,null,"Vermeidungschancen"]
[null,"7.Außerbetriebnahme",null,"Gefärdungen_durch_Materialien_und_Substanzen","G",null,null,"leicht zu verhindern","P1"]
[null,"8. Reinigung",null,"Ergonomische_Gefährdungen","H",null,null,"Kaum möglich","P2"]
[null,"9.Wartung",null,"Umwelteinflüsse","I"]
[null,"10. Störungsbeseitigung/Reparatur",null,"Kombination_von_Gefährdungen","J"]
[null,"11. Entsorgung"]
[]
[]
[]
[]
[null,"Mögliche Ursprünge der Gefährdungen"]
[]
[null,"Mechanische Gefährdung",null,"Elektrische Gefährdung",null,"Thermische Gefährungen",null,"Gefährdung durch Lärm",null,"Gefährdung durch Vibration",null,"Gefährdung durch Strahlung",null,"Gefährdungen durch Materialien und Substanzen",null,"Ergonomische Gefährdungen",null,"Umwelteinflüsse",null,"Kombination aus Gefährdungen"]
[null,"Beschleunigung/Abbremsung",null,"Lichtbogen",null,"Explosion",null,"Betrieb der Maschine erzeugt Lärm",null,"Kavitationsvorgänge",null,"ionisierende Strahlungsquelle",null,"Staub ",null,"Zugang",null,"Staub und Nebel",null,"Allgemeine Verletzungsgefahr"]
[null,"spitze Teile",null,"elektromagnetische Vorgänge",null,"Objekte hoher oder niedriger Temperatur",null,"Abluftsystem",null,"Fehlausrichtung sich bewegender Teile",null,"elekromagnetische Strahlung",null,"Feuchtigkeit",null,"Gestaltung oder Anordnung von Anzeigen/Displays",null,"elektromagnetische Störungen"]
[null,"Annäherung eines sich bewegendes Teils an ein feststehendes Teil",null,"elektrostatische Vorgänge",null,"Strahlung von Wärmequellen",null,"mit hoher Geschwindigkeit austretendes Gas",null,"bewegliche Ausrüstung",null,"optische Strahlung (Laserstrahlung)",null,"Explosivstoff",null,"Gestaltung oder Anordnung von Bedienungseinrichtung",null,"Blitzschlag"]
[null,"schneidende Teile",null,"spannungsführende Teile",null,"Flammen",null,"Herstellungsprozess",null,"reibende Flächen",{"$nulls":3},"Flüssigkeit",null,"Anstrengung",null,"Feuchtigkeit"]
[null,"elastische Teile",null,"unzureichender Abstand zu unter Hochspannung stehenden Teilen",{"$nulls":3},"bewegliche Teile",null,"mit Unwucht rotierende Teile",{"$nulls":3},"Dämpfe",null,"Flackern;Blenden;Schattenbildung und stroboskopische Effekte",null,"Verunreinigung"]
[null,"herab fallende Gegenstände",null,"Überlast",{"$nulls":3},"reibende Flächen",null,"schwingende Ausrüstung",{"$nulls":5},"örtliche Beleuchtung",null,"Temperatur"]
[null,"Schwerkraft",null,"Teile,die im Fehlerzustand spannungsführend gworden sind",{"$nulls":3},"mit Unwucht rotierende Teile",null,"verschlissene Teile",{"$nulls":5},"psychische Überbelastung/Unterforderung",null,"Sauerstoffmangel"]
[null,"Höhe gegenüber Boden",null,"Kurzschluss",{"$nulls":3},"pfeifende Pneumatik-Einrichtungen",{"$nulls":7},"Körperhaltung"]
[null,"Hochdruck",null,"Wärmestrahlung",{"$nulls":3},"verschlissene Teile",{"$nulls":7},"sich wiederholende Tätigkeiten"]
[null,"fehlende Standfestigkeit/-sicherheit",{"$nulls":13},"Sichtbarkeit"]
[null,"sich bewegende Teile"]
[null,"rotierende Teile"]
[null,"raue, rutschige Oberfläche"]
[null,"scharfe Kanten"]
[null,"gespeicherte Energie"]
[null,"Vakuum"]
[]
[null,"Mögliche Folgen der Gefährdungen"]
[]
[null,"Folgen von mechanischen Gefährdungen",null,"Folgen von elektrischen Gefährdungen",null,"Folgen von thermischen Gefährdungen",null,"Mögliche Folgen von Lärm",null,"Mögliche Folgen von Vibration",null,"Mögliche Folgen von Strahlung",null,"Mögliche Folgen aus Gefährungen von Materialien",null,"Folgen aus ergonomischen Gefährdungen",null,"Folgen aus Umwelteinflüsse",null,"Folgen aus kombinierten Gefährdungen"]
[null,"Quetschen",null,"Verbrennung",null,"Verbrennung",null,"Unbehagen",null,"Unbehagen ",null,"Verbrennung",null,"Atembeschwerden",null,"Unbehagen",null,"Verbrennung",null,"Allgemeine Verletzungen"]
[null,"Schneiden oder Abschneiden",null,"chemische Reaktion",null,"Dehydrierung",null,"Bewusstseinsverlust",null,"Erkrankungen der unteren Wirbelsäule",null,"Augen und Hautschädigung",null,"Ersticken",null,"Ermüden",null,"Erkrankungen",null,"Bewusstseinsverlust"]
[null,"Einziehen oder Fangen",null,"Auswirkung auf medizinische Implantate",null,"Unbehagen",null,"Gleichgewichtsstörung",null,"neurologische Erkrankungen",null,"Ausfall von Herzschrittmacher o/ä",null,"Krebs",null,"Störung des Bewegungsapparates",null,"Ausrutschen,Stürze",null,"Unbehagen"]
[null,"Scheren",null,"tödlicher Stromschlag",null,"Erfrierung",null,"Schwerhörigkeit",null,"Knochengelenkschaden",null,"Mutation",null,"Korrosion",null,"Stress",null,"Ersticken",null,"Stress"]
[null,"Überfahren werden",null,"Stürzen",null,"Verletzung durch Strahlung von Wärmequellen",null,"Stress",null,"Wirbelsäulenverletzung",null,"Physische Beeinträchtigung(Kopfschmerzen,Schlaflosigkeit)",null,"Auswirkung auf Fortpflanzungsfähigkeit",null,"alle weiteren Probleme als Folge von menschlichen Fehhlverhaltens (z.B mechanisch, elektrisch,…)",null,"Korrosion"]
[null,"Erfassen",null,"Feuer",null,"Verbrühung",null,"Tinnitus",null,"Gefäßerkrankung",{"$nulls":3},"Explosion"]
[null,"Reiben oder Abschürfen",null,"Herausschleudern von geschmolzenen Teilen",{"$nulls":3},"Ermüdung",{"$nulls":5},"Feuer"]
[null,"Eindringen von unter Druck stehender Medien",null,"(elektrischer) Schlag",{"$nulls":9},"Infektion"]
[null,"Ausrutschen, Stolpern und Stürzen",{"$nulls":11},"Vergiftung"]
[null,"Weggeschleudert werden",{"$nulls":11},"Sensibilisierung"]
[null,"Durchstich, Einstich",{"$nulls":11},"Veränderung des Erbguts"]
[null,"Ersticken"]
[null,"Stoßen"]

{"sheet":"Produkt-Grenzen,Layout,Info's","index":2,"n_rows":15,"n_cols":20,"rows_kept":15,"merged":[[0,0,5,21]]}
["Maschinenlayout"]
{"$rows_empty":13}
[{"$nulls":19},"  "]

{"sheet":"Abnahmeprotokoll","index":3,"n_rows":21,"n_cols":16,"rows_kept":21,"merged":[[1,2,1,5],[2,2,2,5]]}
[]
[null,"Projekt",{"$f":"Deckblatt!D7","v":0}]
[null,"Müller Modell-Nr",{"$f":"Deckblatt!D8","v":0}]
[]
[null,null,"Unterschrift Prüfer 1","Name Prüfer 1","Unterschrift Prüfer 2","Name Prüfer 2","Unterschrift Prüfer 3","Name Prüfer 3","Unterschrift Prüfer 4","Name Prüfer 4","Unterschrift Prüfer 5","Name Prüfer 5","Unterschrift Prüfer 6","Name Prüfer 6","Unterschrift Prüfer 7","Name Prüfer 7"]
[null,null,"Projektleiter*in",{"$f":"Deckblatt!D24","v":0},"Systeming.",{"$f":"Deckblatt!D25","v":0},"EE-Hardware",{"$f":"Deckblatt!D26","v":0},"EE-Software",{"$f":"Deckblatt!D27","v":0},"Techn.Doku.",{"$f":"Deckblatt!D28","v":0},"Entw.-Leitung",{"$f":"Deckblatt!D29","v":0},"Produktion",{"$f":"Deckblatt!D30","v":0}]
[null,"DATUM"]
[null,"Unterschrift"]
[null,"A-Alle"]
[null,"1. Verpacken"]
[null,"2. Lagerung"]
[null,"3 Transport innerbetrieblich\n   Transport außerbetrieblich"]
[null,"4. Installation"]
[null,"5. Inbetriebnahme"]
[null,"6.Betrieb"]
[null,"7.Stillsetzen-Notfall\n   Stillsetzen-Regulär\n   Stillsetzen-Langfristig"]
[null,"8. Reinigung"]
[null,"9.Wartung"]
[null,"10. Störungsbeseitigung/Reparatur"]
[null,"11. Entsorgung"]
[null,"Dateiname:",{"$f":"MID(CELL(\"Dateiname\",A1),SEARCH(\"[\",CELL(\"Dateiname\",A1),1)+1,SEARCH(\"]\",CELL(\"Dateiname\",A1),1)-SEARCH(\"[\",CELL(\"Dateiname\",A1),1)-1)","v":"Risikobeurteilung_Template.xlsx"}]

{"sheet":"Alle","index":4,"n_rows":34,"n_cols":20,"rows_kept":34,"merged":[[0,0,3,4],[0,5,3,7],[0,8,3,11],[0,13,0,15],[0,17,0,20],[1,13,1,15],[1,17,1,20],[2,13,2,15],[2,17,2,20],[3,13,3,20],[4,0,4,1],[4,2,4,5],[4,6,7,9],[4,10,6,12],[4,13,7,16],[4,17,6,20],[5,0,5,1],[5,2,5,5],[6,0,6,1],[6,2,6,5],[7,0,8,0],[7,1,8,1],[7,2,8,3],[7,4,8,4],[7,5,8,5],[7,10,7,12],[7,17,7,20],[8,19,8,20],[9,19,9,20],[10,19,10,20],[11,19,11,20],[12,19,12,20],[13,19,13,20],[14,19,14,20],[15,19,15,20],[16,19,16,20],[17,19,17,20],[18,19,18,20],[19,19,19,20],[20,19,20,20],[21,19,21,20],[22,19,22,20],[23,19,23,20],[24,19,24,20],[25,19,25,20],[26,19,26,20],[27,19,27,20],[28,19,28,20],[29,19,29,20]]}
[{"$nulls":5},"Risikobeurteilung nach\nDIN EN ISO 12100:2011\nDIN EN ISO 13849",null,null,"Erstellt durch:",{"$nulls":3},"Name:",{"$f":"Deckblatt!D24","v":0},null,null,"Name:",{"$f":"Deckblatt!D25","v":0}]
[{"$nulls":12},"Name:",{"$f":"Deckblatt!D26","v":0},null,null,"Name:",{"$f":"Deckblatt!D27","v":0}]
[{"$nulls":12},"Name:",{"$f":"Deckblatt!D28","v":0},null,null,"Name:",{"$f":"Deckblatt!D29","v":0}]
[{"$nulls":12},"Datum",{"$f":"Deckblatt!E4","v":"00:00:00"}]
["Projekt",null,{"$f":"Deckblatt!D7","v":0}]
["Müller Modell-Nr",null,{"$f":"Deckblatt!D8","v":0}]
["Lebensphase",null,"A-Alle"]
["Lfd-Nr.","Beschreibung der gefahrbringenden Situation","Gefährdungsart",null,"Gefährdungsursprung","Folgen",{"$nulls":4},"Maßnahmen",{"$nulls":6},"Maßnahme umgesetzt/wirksam"]
[{"$nulls":6},"S","F","P","Grenzrisiko\nGrenze=B","Konstruktiv","Schutzmaßnahmen","Benutzerinformationen","S","F","P","Grenzrisiko\nGrenze=B","J","N","Bemerkungen Belege/Nachweise"]
[1,null,"Mechanische_Gefährdung",{"$f":"VLOOKUP(C10,[1]Legende!D6:E15,2,FALSE)","v":"A"},"Mechanische Gefährdung","Stoßen","S1","F1","P1",{"$f":"IF(AND(G10=\"S1\",H10=\"F1\",I10=\"P1\"),\"Risiko A\",IF(AND(G10=\"S1\",H10=\"F1\",I10=\"P2\"),\"Risiko B\",IF(AND(G10=\"S1\",H10=\"F2\",I10=\"P1\"),\"Risiko B\",IF(AND(G10=\"S1\",H10=\"F2\",I10=\"P2\"),\"Risiko C\",IF(AND(G10=\"S2\",H10=\"F1\",I10=\"P1\"),\"Risiko C\",IF(AND(G10=\"S2\",H10=\"F1\",I10=\"P2\"),\"Risiko D\",IF(AND(G10=\"S2\",H10=\"F2\",I10=\"P1\"),\"Risiko D\",IF(AND(G10=\"S2\",H10=\"F2\",I10=\"P2\"),\"Risiko E\",\"Pfad wählen\"))))))))","v":"Risiko A"},{"$nulls":3},"S1","F1","P1",{"$f":"IF(AND(N10=\"S1\",O10=\"F1\",P10=\"P1\"),\"Risiko A\",IF(AND(N10=\"S1\",O10=\"F1\",P10=\"P2\"),\"Risiko B\",IF(AND(N10=\"S1\",O10=\"F2\",P10=\"P1\"),\"Risiko B\",IF(AND(N10=\"S1\",O10=\"F2\",P10=\"P2\"),\"Risiko C\",IF(AND(N10=\"S2\",O10=\"F1\",P10=\"P1\"),\"Risiko C\",IF(AND(N10=\"S2\",O10=\"F1\",P10=\"P2\"),\"Risiko D\",IF(AND(N10=\"S2\",O10=\"F2\",P10=\"P1\"),\"Risiko D\",IF(AND(N10=\"S2\",O10=\"F2\",P10=\"P2\"),\"Risiko E\",\"Pfad wählen\"))))))))","v":"Risiko A"}]
[{"$f":"A10+1","v":2},null,"Kombination_von_Gefährdungen",{"$f":"VLOOKUP(C11,[1]Legende!D6:E15,2,FALSE)","v":"J"},"Allgemeine Verletzungsgefahr","Allgemeine Verletzungen","S1","F1","P1",{"$f":"IF(AND(G11=\"S1\",H11=\"F1\",I11=\"P1\"),\"Risiko A\",IF(AND(G11=\"S1\",H11=\"F1\",I11=\"P2\"),\"Risiko B\",IF(AND(G11=\"S1\",H11=\"F2\",I11=\"P1\"),\"Risiko B\",IF(AND(G11=\"S1\",H11=\"F2\",I11=\"P2\"),\"Risiko C\",IF(AND(G11=\"S2\",H11=\"F1\",I11=\"P1\"),\"Risiko C\",IF(AND(G11=\"S2\",H11=\"F1\",I11=\"P2\"),\"Risiko D\",IF(AND(G11=\"S2\",H11=\"F2\",I11=\"P1\"),\"Risiko D\",IF(AND(G11=\"S2\",H11=\"F2\",I11=\"P2\"),\"Risiko E\",\"Pfad wählen\"))))))))","v":"Risiko A"},{"$nulls":3},"S1","F1","P1","Risiko A"]
[{"$f":"A11+1","v":3},null,"Kombination_von_Gefährdungen",{"$f":"VLOOKUP(C12,[1]Legende!D6:E15,2,FALSE)","v":"J"},"Allgemeine Verletzungsgefahr","Allgemeine Verletzungen","S1","F1","P1","Risiko A",{"$nulls":3},"S1","F1","P1","Risiko A"]
[{"$f":"A12+1","v":4},null,"Elektrische_Gefährdung",{"$f":"VLOOKUP(C13,[1]Legende!D6:E15,2,FALSE)","v":"B"},"Elektrische Gefährdung","Folgen von elektrischen Gefährdungen","S1","F1","P1","Risiko A",{"$nulls":3},"S1","F1","P1","Risiko A"]
[5,null,"Mechanische_Gefährdung",{"$f":"VLOOKUP(C14,[1]Legende!D6:E15,2,FALSE)","v":"A"},"Mechanische Gefährdung","Einziehen oder Fangen","S1","F1","P1","Risiko A",{"$nulls":3},"S1","F1","P1","Risiko A"]
[6,null,"Kombination_von_Gefährdungen",{"$f":"VLOOKUP(C15,Legende!D6:E15,2,FALSE)","v":"J"},"Allgemeine Verletzungsgefahr","Allgemeine Verletzungen","S1","F1","P1","Risiko A",{"$nulls":3},"S1","F1","P1","Risiko A"]
[7,null,"Kombination_von_Gefährdungen",{"$f":"VLOOKUP(C16,Legende!D6:E15,2,FALSE)","v":"J"},"Allgemeine Verletzungsgefahr","Allgemeine Verletzungen","S1","F1","P1","Risiko A",{"$nulls":3},"S1","F2","P1","Risiko B"]
[8,null,"Mechanische_Gefährdung",{"$f":"VLOOKUP(C17,Legende!D6:E15,2,FALSE)","v":"A"},"Mechanische Gefährdung","Quetschen","S1","F1","P1","Risiko A",{"$nulls":3},"S1","F1","P1","Risiko A"]
[9,null,"Mechanische_Gefährdung",{"$f":"VLOOKUP(C18,Legende!D6:E15,2,FALSE)","v":"A"},"schneidende Teile","Schneiden oder Abschneiden","S1","F1","P1","Risiko A",{"$nulls":3},"S1","F1","P1","Risiko A"]
[10,null,"Gefärdungen_durch_Materialien_und_Substanzen",{"$f":"VLOOKUP(C19,Legende!D6:E15,2,FALSE)","v":"G"},"Staub ","Atembeschwerden","S1","F1","P1","Risiko A",{"$nulls":3},"S1","F1","P1","Risiko A"]
[11,null,"Mechanische_Gefährdung",{"$f":"VLOOKUP(C20,Legende!D6:E15,2,FALSE)","v":"A"},"Mechanische Gefährdung","Reiben oder Abschürfen","S1","F1","P1","Risiko A",{"$nulls":3},"S1","F1","P1","Risiko A"]
[12,null,null,{"$f":"VLOOKUP(C21,Legende!D6:E15,2,FALSE)","v":{"$error":"#N/A"}},{"$nulls":5},"Pfad wählen",{"$nulls":6},"Pfad wählen"]
[13,null,null,{"$f":"VLOOKUP(C22,Legende!D6:E15,2,FALSE)","v":{"$error":"#N/A"}},{"$nulls":5},"Pfad wählen",{"$nulls":6},"Pfad wählen"]
[14,null,null,{"$f":"VLOOKUP(C23,Legende!D6:E15,2,FALSE)","v":{"$error":"#N/A"}},{"$nulls":5},"Pfad wählen",{"$nulls":6},"Pfad wählen"]
[15,null,null,{"$f":"VLOOKUP(C24,Legende!D6:E15,2,FALSE)","v":{"$error":"#N/A"}},{"$nulls":5},"Pfad wählen",{"$nulls":6},"Pfad wählen"]
[16,null,null,{"$f":"VLOOKUP(C25,Legende!D6:E15,2,FALSE)","v":{"$error":"#N/A"}},{"$nulls":5},"Pfad wählen",{"$nulls":6},"Pfad wählen"]
[17,null,null,{"$f":"VLOOKUP(C26,Legende!D6:E15,2,FALSE)","v":{"$error":"#N/A"}},{"$nulls":5},"Pfad wählen",{"$nulls":6},"Pfad wählen"]
[18,null,null,{"$f":"VLOOKUP(C27,Legende!D6:E15,2,FALSE)","v":{"$error":"#N/A"}},{"$nulls":5},"Pfad wählen",{"$nulls":6},"Pfad wählen"]
[19,null,null,{"$f":"VLOOKUP(C28,Legende!D6:E15,2,FALSE)","v":{"$error":"#N/A"}},{"$nulls":5},"Pfad wählen",{"$nulls":6},"Pfad wählen"]
[20,null,null,{"$f":"VLOOKUP(C29,Legende!D6:E15,2,FALSE)","v":{"$error":"#N/A"}},{"$nulls":5},"Pfad wählen",{"$nulls":6},"Pfad wählen"]
[21,null,null,{"$f":"VLOOKUP(C30,Legende!D6:E15,2,FALSE)","v":{"$error":"#N/A"}},{"$nulls":5},"Pfad wählen",{"$nulls":6},"Pfad wählen"]
[]
[]
[]
[{"$nulls":7}," "]

{"sheet":"1.Verpacken","index":5,"n_rows":30,"n_cols":20,"rows_kept":30,"merged":[[0,0,3,4],[0,5,3,7],[0,8,3,11],[0,13,0,15],[0,17,0,20],[1,13,1,15],[1,17,1,20],[2,13,2,15],[2,17,2,20],[3,13,3,20],[4,0,4,1],[4,2,4,5],[4,6,7,9],[4,10,6,12],[4,13,7,16],[4,17,6,20],[5,0,5,1],[5,2,5,5],[6,0,6,1],[6,2,6,5],[7,0,8,0],[7,1,8,1],[7,2,8,3],[7,4,8,4],[7,5,8,5],[7,10,7,12],[7,17,7,20],[8,19,8,20],[9,19,9,20],[10,19,10,20],[11,19,11,20],[12,19,12,20],[13,19,13,20],[14,19,14,20],[15,19,15,20],[16,19,16,20],[17,19,17,20],[18,19,18,20],[19,19,19,20],[20,19,20,20],[21,19,21,20],[22,19,22,20],[23,19,23,20],[24,19,24,20],[25,19,25,20],[26,19,26,20],[27,19,27,20],[28,19,28,20],[29,19,29,20]]}
[{"$nulls":5},"Risikobeurteilung nach\nDIN EN ISO 12100:2011\nDIN EN ISO 13849",null,null,"Erstellt durch:",{"$nulls":3},"Name:",{"$f":"Deckblatt!D24","v":0},null,null,"Name:",{"$f":"Deckblatt!D25","v":0}]
[{"$nulls":12},"Name:",{"$f":"Deckblatt!D26","v":0},null,null,"Name:",{"$f":"Deckblatt!D27","v":0}]
[{"$nulls":12},"Name:",{"$f":"Deckblatt!D28","v":0},null,null,"Name:",{"$f":"Deckblatt!D29","v":0}]
[{"$nulls":12},"Datum",{"$f":"Deckblatt!E4","v":"00:00:00"}]
["Projekt",null,{"$f":"Deckblatt!D7","v":0}]
["Müller Modell-Nr",null,{"$f":"Deckblatt!D8","v":0}]
["Lebensphase",null,"1. Verpacken"]
["Lfd-Nr.","Beschreibung der gefahrbringenden Situation","Gefährdungsart",null,"Gefährdungsursprung","Folgen",{"$nulls":4},"Maßnahmen",{"$nulls":6},"Maßnahme umgesetzt/wirksam"]
[{"$nulls":6},"S","F","P","Grenzrisiko\nGrenze=B","Konstruktiv","Schutzmaßnahmen","Benutzerinformationen","S","F","P","Grenzrisiko\nGrenze=B","J","N","Bemerkungen Belege/Nachweise"]
[1,null,"Mechanische_Gefährdung",{"$f":"VLOOKUP(C10,Legende!D6:E15,2,FALSE)","v":"A"},"Mechanische Gefährdung","Quetschen","S1","F1","P1",{"$f":"IF(AND(G10=\"S1\",H10=\"F1\",I10=\"P1\"),\"Risiko A\",IF(AND(G10=\"S1\",H10=\"F1\",I10=\"P2\"),\"Risiko B\",IF(AND(G10=\"S1\",H10=\"F2\",I10=\"P1\"),\"Risiko B\",IF(AND(G10=\"S1\",H10=\"F2\",I10=\"P2\"),\"Risiko C\",IF(AND(G10=\"S2\",H10=\"F1\",I10=\"P1\"),\"Risiko C\",IF(AND(G10=\"S2\",H10=\"F1\",I10=\"P2\"),\"Risiko D\",IF(AND(G10=\"S2\",H10=\"F2\",I10=\"P1\"),\"Risiko D\",IF(AND(G10=\"S2\",H10=\"F2\",I10=\"P2\"),\"Risiko E\",\"Pfad wählen\"))))))))","v":"Risiko A"},"-",null,null,"S1","F1","P1",{"$f":"IF(AND(N10=\"S1\",O10=\"F1\",P10=\"P1\"),\"Risiko A\",IF(AND(N10=\"S1\",O10=\"F1\",P10=\"P2\"),\"Risiko B\",IF(AND(N10=\"S1\",O10=\"F2\",P10=\"P1\"),\"Risiko B\",IF(AND(N10=\"S1\",O10=\"F2\",P10=\"P2\"),\"Risiko C\",IF(AND(N10=\"S2\",O10=\"F1\",P10=\"P1\"),\"Risiko C\",IF(AND(N10=\"S2\",O10=\"F1\",P10=\"P2\"),\"Risiko D\",IF(AND(N10=\"S2\",O10=\"F2\",P10=\"P1\"),\"Risiko D\",IF(AND(N10=\"S2\",O10=\"F2\",P10=\"P2\"),\"Risiko E\",\"Pfad wählen\"))))))))","v":"Risiko A"}]
[{"$f":"A10+1","v":2},null,"Ergonomische_Gefährdungen",{"$f":"VLOOKUP(C11,Legende!D6:E15,2,FALSE)","v":"H"},"Anstrengung","Störung des Bewegungsapparates","S1","F1","P1",{"$f":"IF(AND(G11=\"S1\",H11=\"F1\",I11=\"P1\"),\"Risiko A\",IF(AND(G11=\"S1\",H11=\"F1\",I11=\"P2\"),\"Risiko B\",IF(AND(G11=\"S1\",H11=\"F2\",I11=\"P1\"),\"Risiko B\",IF(AND(G11=\"S1\",H11=\"F2\",I11=\"P2\"),\"Risiko C\",IF(AND(G11=\"S2\",H11=\"F1\",I11=\"P1\"),\"Risiko C\",IF(AND(G11=\"S2\",H11=\"F1\",I11=\"P2\"),\"Risiko D\",IF(AND(G11=\"S2\",H11=\"F2\",I11=\"P1\"),\"Risiko D\",IF(AND(G11=\"S2\",H11=\"F2\",I11=\"P2\"),\"Risiko E\",\"Pfad wählen\"))))))))","v":"Risiko A"},"-",null,null,"S1","F1","P1","Risiko A"]
[{"$f":"A11+1","v":3},null,"Mechanische_Gefährdung",{"$f":"VLOOKUP(C12,Legende!D6:E15,2,FALSE)","v":"A"},"Mechanische Gefährdung","Quetschen","S1","F1","P1","Risiko A","-",null,null,"S1","F1","P1","Risiko A"]
[{"$f":"A12+1","v":4},null,"Mechanische_Gefährdung","A","Mechanische Gefährdung","Quetschen","S1","F1","P1","Risiko A","-",null,null,"S1","F1","P1","Risiko A"]
[5,null,"Mechanische_Gefährdung","A","herab fallende Gegenstände","Reiben oder Abschürfen","S1","F1","P1","Risiko A","-",null,null,"S1","F1","P1","Risiko A"]
[6,null,"Umwelteinflüsse",{"$f":"VLOOKUP(C15,[1]Legende!D7:E16,2,FALSE)","v":"I"},"Verunreinigung","Erkrankungen","S1","F1","P1","Risiko A","-",null,null,"S1","F1","P1","Risiko A"]
[7,null,"Ergonomische_Gefährdungen",{"$f":"VLOOKUP(C16,[1]Legende!D7:E16,2,FALSE)","v":"H"},"Körperhaltung","Ermüden","S1","F1","P1","Risiko A","-",null,null,"S1","F1","P1","Risiko A"]
[8,null,"Mechanische_Gefährdung","A","Schwerkraft","Quetschen","S1","F1","P1","Risiko A","-",null,null,"S1","F1","P1","Risiko A"]
[9,null,"Umwelteinflüsse",{"$f":"VLOOKUP(C18,[1]Legende!D7:E16,2,FALSE)","v":"I"},"Verunreinigung","Erkrankungen","S1","F1","P1","Risiko A","-",null,null,"S1","F1","P1","Risiko A"]
[10,null,"Mechanische_Gefährdung",{"$f":"VLOOKUP(C19,Legende!D6:E15,2,FALSE)","v":"A"},"Schwerkraft","Erfassen","S1","F1","P1","Risiko A","-",null,null,"S1","F1","P1","Risiko A"]
[11,null,"Elektrische_Gefährdung",{"$f":"VLOOKUP(C20,Legende!D6:E15,2,FALSE)","v":"B"},"Elektrische Gefährdung","tödlicher Stromschlag","S1","F1","P1","Risiko A","-",null,null,"S1","F1","P1","Risiko A"]
[12,null,"Mechanische_Gefährdung",{"$f":"VLOOKUP(C21,[1]Legende!D12:E21,2,FALSE)","v":{"$error":"#N/A"}},"Schwerkraft","Quetschen","S1","F1","P1","Risiko A","-",null,null,"S1","F1","P1","Risiko A"]
[13,null,null,{"$f":"VLOOKUP(C22,Legende!D6:E15,2,FALSE)","v":{"$error":"#N/A"}},{"$nulls":5},"Pfad wählen",{"$nulls":6},"Pfad wählen"]
[14,null,null,{"$f":"VLOOKUP(C23,Legende!D6:E15,2,FALSE)","v":{"$error":"#N/A"}},{"$nulls":5},"Pfad wählen",{"$nulls":6},"Pfad wählen"]
[15,null,null,{"$f":"VLOOKUP(C24,Legende!D6:E15,2,FALSE)","v":{"$error":"#N/A"}},{"$nulls":5},"Pfad wählen",{"$nulls":6},"Pfad wählen"]
[16,null,null,{"$f":"VLOOKUP(C25,Legende!D6:E15,2,FALSE)","v":{"$error":"#N/A"}},{"$nulls":5},"Pfad wählen",{"$nulls":6},"Pfad wählen"]
[17,null,null,{"$f":"VLOOKUP(C26,Legende!D6:E15,2,FALSE)","v":{"$error":"#N/A"}},{"$nulls":5},"Pfad wählen",{"$nulls":6},"Pfad wählen"]
[18,null,null,{"$f":"VLOOKUP(C27,Legende!D6:E15,2,FALSE)","v":{"$error":"#N/A"}},{"$nulls":5},"Pfad wählen",{"$nulls":6},"Pfad wählen"]
[19,null,null,{"$f":"VLOOKUP(C28,Legende!D6:E15,2,FALSE)","v":{"$error":"#N/A"}},{"$nulls":5},"Pfad wählen",{"$nulls":6},"Pfad wählen"]
[20,null,null,{"$f":"VLOOKUP(C29,Legende!D6:E15,2,FALSE)","v":{"$error":"#N/A"}},{"$nulls":5},"Pfad wählen",{"$nulls":6},"Pfad wählen"]
[21,null,null,{"$f":"VLOOKUP(C30,Legende!D6:E15,2,FALSE)","v":{"$error":"#N/A"}},{"$nulls":5},"Pfad wählen",{"$nulls":6},"Pfad wählen"]

{"sheet":"2.Lagerung","index":6,"n_rows":30,"n_cols":20,"rows_kept":30,"merged":[[0,0,3,4],[0,5,3,7],[0,8,3,11],[0,13,0,15],[0,17,0,20],[1,13,1,15],[1,17,1,20],[2,13,2,15],[2,17,2,20],[3,13,3,20],[4,0,4,1],[4,2,4,5],[4,6,7,9],[4,10,6,12],[4,13,7,16],[4,17,6,20],[5,0,5,1],[5,2,5,5],[6,0,6,1],[6,2,6,5],[7,0,8,0],[7,1,8,1],[7,2,8,3],[7,4,8,4],[7,5,8,5],[7,10,7,12],[7,17,7,20],[8,19,8,20],[9,19,9,20],[10,19,10,20],[11,19,11,20],[12,19,12,20],[13,19,13,20],[14,19,14,20],[15,19,15,20],[16,19,16,20],[17,19,17,20],[18,19,18,20],[19,19,19,20],[20,19,20,20],[21,19,21,20],[22,19,22,20],[23,19,23,20],[24,19,24,20],[25,19,25,20],[26,19,26,20],[27,19,27,20],[28,19,28,20],[29,19,29,20]]}
[{"$nulls":5},"Risikobeurteilung nach\nDIN EN ISO 12100:2011\nDIN EN ISO 13849",null,null,"Erstellt durch:",{"$nulls":3},"Name:",{"$f":"Deckblatt!D24","v":0},null,null,"Name:",{"$f":"Deckblatt!D25","v":0}]
[{"$nulls":12},"Name:",{"$f":"Deckblatt!D26","v":0},null,null,"Name:",{"$f":"Deckblatt!D27","v":0}]
[{"$nulls":12},"Name:",{"$f":"Deckblatt!D28","v":0},null,null,"Name:",{"$f":"Deckblatt!D29","v":0}]
[{"$nulls":12},"Datum",{"$f":"Deckblatt!E4","v":"00:00:00"}]
["Projekt",null,{"$f":"Deckblatt!D7","v":0}]
["Müller Modell-Nr",null,{"$f":"Deckblatt!D8","v":0}]
["Lebensphase",null,"2. Lagerung"]
["Lfd-Nr.","Beschreibung der gefahrbringenden Situation","Gefährdungsart",null,"Gefährdungsursprung","Folgen",{"$nulls":4},"Maßnahmen",{"$nulls":6},"Maßnahme umgesetzt/wirksam"]
[{"$nulls":6},"S","F","P","Grenzrisiko\nGrenze=B","Konstruktiv","Schutzmaßnahmen","Benutzerinformationen","S","F","P","Grenzrisiko\nGrenze=B","J","N","Bemerkungen Belege/Nachweise"]
[1,null,"Umwelteinflüsse",{"$f":"VLOOKUP(C10,Legende!D6:E15,2,FALSE)","v":"I"},"Feuchtigkeit","Korrosion","S1","F1","P1",{"$f":"IF(AND(G10=\"S1\",H10=\"F1\",I10=\"P1\"),\"Risiko A\",IF(AND(G10=\"S1\",H10=\"F1\",I10=\"P2\"),\"Risiko B\",IF(AND(G10=\"S1\",H10=\"F2\",I10=\"P1\"),\"Risiko B\",IF(AND(G10=\"S1\",H10=\"F2\",I10=\"P2\"),\"Risiko C\",IF(AND(G10=\"S2\",H10=\"F1\",I10=\"P1\"),\"Risiko C\",IF(AND(G10=\"S2\",H10=\"F1\",I10=\"P2\"),\"Risiko D\",IF(AND(G10=\"S2\",H10=\"F2\",I10=\"P1\"),\"Risiko D\",IF(AND(G10=\"S2\",H10=\"F2\",I10=\"P2\"),\"Risiko E\",\"Pfad wählen\"))))))))","v":"Risiko A"},{"$nulls":3},"S1","F1","P1",{"$f":"IF(AND(N10=\"S1\",O10=\"F1\",P10=\"P1\"),\"Risiko A\",IF(AND(N10=\"S1\",O10=\"F1\",P10=\"P2\"),\"Risiko B\",IF(AND(N10=\"S1\",O10=\"F2\",P10=\"P1\"),\"Risiko B\",IF(AND(N10=\"S1\",O10=\"F2\",P10=\"P2\"),\"Risiko C\",IF(AND(N10=\"S2\",O10=\"F1\",P10=\"P1\"),\"Risiko C\",IF(AND(N10=\"S2\",O10=\"F1\",P10=\"P2\"),\"Risiko D\",IF(AND(N10=\"S2\",O10=\"F2\",P10=\"P1\"),\"Risiko D\",IF(AND(N10=\"S2\",O10=\"F2\",P10=\"P2\"),\"Risiko E\",\"Pfad wählen\"))))))))","v":"Risiko A"}]
[{"$f":"A10+1","v":2},null,"Umwelteinflüsse",{"$f":"VLOOKUP(C11,Legende!D6:E15,2,FALSE)","v":"I"},"Feuchtigkeit","Korrosion","S1","F1","P1",{"$f":"IF(AND(G11=\"S1\",H11=\"F1\",I11=\"P1\"),\"Risiko A\",IF(AND(G11=\"S1\",H11=\"F1\",I11=\"P2\"),\"Risiko B\",IF(AND(G11=\"S1\",H11=\"F2\",I11=\"P1\"),\"Risiko B\",IF(AND(G11=\"S1\",H11=\"F2\",I11=\"P2\"),\"Risiko C\",IF(AND(G11=\"S2\",H11=\"F1\",I11=\"P1\"),\"Risiko C\",IF(AND(G11=\"S2\",H11=\"F1\",I11=\"P2\"),\"Risiko D\",IF(AND(G11=\"S2\",H11=\"F2\",I11=\"P1\"),\"Risiko D\",IF(AND(G11=\"S2\",H11=\"F2\",I11=\"P2\"),\"Risiko E\",\"Pfad wählen\"))))))))","v":"Risiko A"},{"$nulls":3},"S1","F1","P1","Risiko A"]
[{"$f":"A11+1","v":3},null,"Elektrische_Gefährdung",{"$f":"VLOOKUP(C12,[1]Legende!D6:E15,2,FALSE)","v":"B"},"Elektrische Gefährdung","Folgen von elektrischen Gefährdungen","S1","F1","P1","Risiko A",{"$nulls":3},"S1","F1","P1","Risiko A"]
[{"$f":"A12+1","v":4},null,"Elektrische_Gefährdung",{"$f":"VLOOKUP(C13,[1]Legende!D6:E15,2,FALSE)","v":"B"},"Elektrische Gefährdung","Folgen von elektrischen Gefährdungen","S1","F1","P1","Risiko A",{"$nulls":3},"S1","F1","P1","Risiko A"]
[5,null,"Mechanische_Gefährdung",{"$f":"VLOOKUP(C14,[1]Legende!D6:E15,2,FALSE)","v":"A"},"herab fallende Gegenstände","Erfassen","S1","F1","P1","Risiko A",{"$nulls":3},"S1","F1","P1","Risiko A"]
[6,null,"Mechanische_Gefährdung",{"$f":"VLOOKUP(C15,[1]Legende!D6:E15,2,FALSE)","v":"A"},"herab fallende Gegenstände","Quetschen","S1","F1","P1","Risiko A",{"$nulls":3},"S1","F1","P1","Risiko A"]
[7,null,"Mechanische_Gefährdung",{"$f":"VLOOKUP(C16,[1]Legende!D6:E15,2,FALSE)","v":"A"},"Annäherung eines sich bewegendes Teils an ein feststehendes Teil","Quetschen","S1","F1","P1","Risiko A",{"$nulls":3},"S1","F1","P1","Risiko A"]
[8,null,"Ergonomische_Gefährdungen",{"$f":"VLOOKUP(C17,[1]Legende!D6:E15,2,FALSE)","v":"H"},"Anstrengung","Ermüden","S1","F1","P1","Risiko A",{"$nulls":3},"S1","F1","P1","Risiko A"]
[9,null,null,{"$f":"VLOOKUP(C18,[1]Legende!D6:E15,2,FALSE)","v":{"$error":"#N/A"}},{"$nulls":5},"Pfad wählen",{"$nulls":6},"Pfad wählen"]
[10,null,null,{"$f":"VLOOKUP(C19,[1]Legende!D6:E15,2,FALSE)","v":{"$error":"#N/A"}},{"$nulls":5},"Pfad wählen",{"$nulls":6},"Pfad wählen"]
[11,null,null,{"$f":"VLOOKUP(C20,[1]Legende!D6:E15,2,FALSE)","v":{"$error":"#N/A"}},{"$nulls":5},"Pfad wählen",{"$nulls":6},"Pfad wählen"]
[12,null,null,{"$f":"VLOOKUP(C21,[1]Legende!D6:E15,2,FALSE)","v":{"$error":"#N/A"}},{"$nulls":5},"Pfad wählen",{"$nulls":6},"Pfad wählen"]
[13,null,null,{"$f":"VLOOKUP(C22,Legende!D6:E15,2,FALSE)","v":{"$error":"#N/A"}},{"$nulls":5},"Pfad wählen",{"$nulls":6},"Pfad wählen"]
[14,null,null,{"$f":"VLOOKUP(C23,Legende!D6:E15,2,FALSE)","v":{"$error":"#N/A"}},{"$nulls":5},"Pfad wählen",{"$nulls":6},"Pfad wählen"]
[15,null,null,{"$f":"VLOOKUP(C24,Legende!D6:E15,2,FALSE)","v":{"$error":"#N/A"}},{"$nulls":5},"Pfad wählen",{"$nulls":6},"Pfad wählen"]
[16,null,null,{"$f":"VLOOKUP(C25,Legende!D6:E15,2,FALSE)","v":{"$error":"#N/A"}},{"$nulls":5},"Pfad wählen",{"$nulls":6},"Pfad wählen"]
[17,null,null,{"$f":"VLOOKUP(C26,Legende!D6:E15,2,FALSE)","v":{"$error":"#N/A"}},{"$nulls":5},"Pfad wählen",{"$nulls":6},"Pfad wählen"]
[18,null,null,{"$f":"VLOOKUP(C27,Legende!D6:E15,2,FALSE)","v":{"$error":"#N/A"}},{"$nulls":5},"Pfad wählen",{"$nulls":6},"Pfad wählen"]
[19,null,null,{"$f":"VLOOKUP(C28,Legende!D6:E15,2,FALSE)","v":{"$error":"#N/A"}},{"$nulls":5},"Pfad wählen",{"$nulls":6},"Pfad wählen"]
[20,null,null,{"$f":"VLOOKUP(C29,Legende!D6:E15,2,FALSE)","v":{"$error":"#N/A"}},{"$nulls":5},"Pfad wählen",{"$nulls":6},"Pfad wählen"]
[21,null,null,{"$f":"VLOOKUP(C30,Legende!D6:E15,2,FALSE)","v":{"$error":"#N/A"}},{"$nulls":5},"Pfad wählen",{"$nulls":6},"Pfad wählen"]

{"sheet":"3.Transport","index":7,"n_rows":30,"n_cols":20,"rows_kept":30,"merged":[[0,0,3,4],[0,5,3,7],[0,8,3,11],[0,13,0,15],[0,17,0,20],[1,13,1,15],[1,17,1,20],[2,13,2,15],[2,17,2,20],[3,13,3,20],[4,0,4,1],[4,2,4,5],[4,6,7,9],[4,10,6,12],[4,13,7,16],[4,17,6,20],[5,0,5,1],[5,2,5,5],[6,0,6,1],[6,2,6,5],[7,0,8,0],[7,1,8,1],[7,2,8,3],[7,4,8,4],[7,5,8,5],[7,10,7,12],[7,17,7,20],[8,19,8,20],[9,19,9,20],[10,19,10,20],[11,19,11,20],[12,19,12,20],[13,19,13,20],[14,19,14,20],[15,19,15,20],[16,19,16,20],[17,19,17,20],[18,19,18,20],[19,19,19,20],[20,19,20,20],[21,19,21,20],[22,19,22,20],[23,19,23,20],[24,19,24,20],[25,19,25,20],[26,19,26,20],[27,19,27,20],[28,19,28,20],[29,19,29,20]]}
[{"$nulls":5},"Risikobeurteilung nach\nDIN EN ISO 12100:2011\nDIN EN ISO 13849",null,null,"Erstellt durch:",{"$nulls":3},"Name:",{"$f":"Deckblatt!D24","v":0},null,null,"Name:",{"$f":"Deckblatt!D25","v":0}]
[{"$nulls":12},"Name:",{"$f":"Deckblatt!D26","v":0},null,null,"Name:",{"$f":"Deckblatt!D27","v":0}]
[{"$nulls":12},"Name:",{"$f":"Deckblatt!D28","v":0},null,null,"Name:",{"$f":"Deckblatt!D29","v":0}]
[{"$nulls":12},"Datum",{"$f":"Deckblatt!E4","v":"00:00:00"}]
["Projekt",null,{"$f":"Deckblatt!D7","v":0}]
["Müller Modell-Nr",null,{"$f":"Deckblatt!D8","v":0}]
["Lebensphase",null,"3 Transport innerbetrieblich\n   Transport außerbetrieblich"]
["Lfd-Nr.","Beschreibung der gefahrbringenden Situation","Gefährdungsart",null,"Gefährdungsursprung","Folgen",{"$nulls":4},"Maßnahmen",{"$nulls":6},"Maßnahme umgesetzt/wirksam"]
[{"$nulls":6},"S","F","P","Grenzrisiko\nGrenze=B","Konstruktiv","Schutzmaßnahmen","Benutzerinformationen","S","F","P","Grenzrisiko\nGrenze=B","J","N","Bemerkungen Belege/Nachweise"]
[1,null,"Mechanische_Gefährdung",{"$f":"VLOOKUP(C10,[1]Legende!D6:E15,2,FALSE)","v":"A"},"Schwerkraft","Quetschen","S1","F1","P1",{"$f":"IF(AND(G10=\"S1\",H10=\"F1\",I10=\"P1\"),\"Risiko A\",IF(AND(G10=\"S1\",H10=\"F1\",I10=\"P2\"),\"Risiko B\",IF(AND(G10=\"S1\",H10=\"F2\",I10=\"P1\"),\"Risiko B\",IF(AND(G10=\"S1\",H10=\"F2\",I10=\"P2\"),\"Risiko C\",IF(AND(G10=\"S2\",H10=\"F1\",I10=\"P1\"),\"Risiko C\",IF(AND(G10=\"S2\",H10=\"F1\",I10=\"P2\"),\"Risiko D\",IF(AND(G10=\"S2\",H10=\"F2\",I10=\"P1\"),\"Risiko D\",IF(AND(G10=\"S2\",H10=\"F2\",I10=\"P2\"),\"Risiko E\",\"Pfad wählen\"))))))))","v":"Risiko A"},"-",null,null,"S1","F1","P1",{"$f":"IF(AND(N10=\"S1\",O10=\"F1\",P10=\"P1\"),\"Risiko A\",IF(AND(N10=\"S1\",O10=\"F1\",P10=\"P2\"),\"Risiko B\",IF(AND(N10=\"S1\",O10=\"F2\",P10=\"P1\"),\"Risiko B\",IF(AND(N10=\"S1\",O10=\"F2\",P10=\"P2\"),\"Risiko C\",IF(AND(N10=\"S2\",O10=\"F1\",P10=\"P1\"),\"Risiko C\",IF(AND(N10=\"S2\",O10=\"F1\",P10=\"P2\"),\"Risiko D\",IF(AND(N10=\"S2\",O10=\"F2\",P10=\"P1\"),\"Risiko D\",IF(AND(N10=\"S2\",O10=\"F2\",P10=\"P2\"),\"Risiko E\",\"Pfad wählen\"))))))))","v":"Risiko A"}]
[{"$f":"A10+1","v":2},null,"Mechanische_Gefährdung",{"$f":"VLOOKUP(C11,[1]Legende!D6:E15,2,FALSE)","v":"A"},"Beschleunigung/Abbremsung","Quetschen","S1","F1","P1",{"$f":"IF(AND(G11=\"S1\",H11=\"F1\",I11=\"P1\"),\"Risiko A\",IF(AND(G11=\"S1\",H11=\"F1\",I11=\"P2\"),\"Risiko B\",IF(AND(G11=\"S1\",H11=\"F2\",I11=\"P1\"),\"Risiko B\",IF(AND(G11=\"S1\",H11=\"F2\",I11=\"P2\"),\"Risiko C\",IF(AND(G11=\"S2\",H11=\"F1\",I11=\"P1\"),\"Risiko C\",IF(AND(G11=\"S2\",H11=\"F1\",I11=\"P2\"),\"Risiko D\",IF(AND(G11=\"S2\",H11=\"F2\",I11=\"P1\"),\"Risiko D\",IF(AND(G11=\"S2\",H11=\"F2\",I11=\"P2\"),\"Risiko E\",\"Pfad wählen\"))))))))","v":"Risiko A"},"-",null,null,"S1","F1","P1","Risiko A"]
[{"$f":"A11+1","v":3},null,"Mechanische_Gefährdung",{"$f":"VLOOKUP(C12,[1]Legende!D6:E15,2,FALSE)","v":"A"},"herab fallende Gegenstände","Quetschen","S1","F1","P1","Risiko A","-",null,null,"S1","F1","P1","Risiko A"]
[{"$f":"A12+1","v":4},null,"Umwelteinflüsse",{"$f":"VLOOKUP(C13,[1]Legende!D6:E15,2,FALSE)","v":"I"},"Feuchtigkeit","Korrosion","S1","F1","P1","Risiko A","-",null,null,"S1","F1","P1","Risiko A"]
[5,null,"Elektrische_Gefährdung",{"$f":"VLOOKUP(C14,[1]Legende!D6:E15,2,FALSE)","v":"B"},"elektrostatische Vorgänge","chemische Reaktion","S1","F1","P1","Risiko A","-",null,null,"S1","F1","P1","Risiko A"]
[6,null,"Mechanische_Gefährdung",{"$f":"VLOOKUP(C15,[1]Legende!D6:E15,2,FALSE)","v":"A"},"Schwerkraft","Quetschen","S1","F1","P1","Risiko A","-",null,null,"S1","F1","P1","Risiko A"]
[7,null,"Mechanische_Gefährdung",{"$f":"VLOOKUP(C16,Legende!D3:E12,2,FALSE)","v":"A"},"Schwerkraft","Erfassen","S1","F1","P1","Risiko A","-",null,null,"S1","F1","P1","Risiko A"]
[8,null,"Mechanische_Gefährdung",{"$f":"VLOOKUP(C17,[1]Legende!D6:E15,2,FALSE)","v":"A"},"Schwerkraft","Erfassen","S1","F1","P1","Risiko A","-",null,null,"S1","F1","P1","Risiko A"]
[9,null,"Mechanische_Gefährdung",{"$f":"VLOOKUP(C18,[1]Legende!D6:E15,2,FALSE)","v":"A"},"Schwerkraft","Erfassen","S1","F1","P1","Risiko A","-",null,null,"S1","F1","P1","Risiko A"]
[10,null,null,{"$f":"VLOOKUP(C19,Legende!D6:E15,2,FALSE)","v":{"$error":"#N/A"}},{"$nulls":5},"Pfad wählen",{"$nulls":6},"Pfad wählen"]
[11,null,null,{"$f":"VLOOKUP(C20,Legende!D6:E15,2,FALSE)","v":{"$error":"#N/A"}},{"$nulls":5},"Pfad wählen",{"$nulls":6},"Pfad wählen"]
[12,null,null,{"$f":"VLOOKUP(C21,Legende!D6:E15,2,FALSE)","v":{"$error":"#N/A"}},{"$nulls":5},"Pfad wählen",{"$nulls":6},"Pfad wählen"]
[13,null,null,{"$f":"VLOOKUP(C22,Legende!D6:E15,2,FALSE)","v":{"$error":"#N/A"}},{"$nulls":5},"Pfad wählen",{"$nulls":6},"Pfad wählen"]
[14,null,null,{"$f":"VLOOKUP(C23,Legende!D6:E15,2,FALSE)","v":{"$error":"#N/A"}},{"$nulls":5},"Pfad wählen",{"$nulls":6},"Pfad wählen"]
[15,null,null,{"$f":"VLOOKUP(C24,Legende!D6:E15,2,FALSE)","v":{"$error":"#N/A"}},{"$nulls":5},"Pfad wählen",{"$nulls":6},"Pfad wählen"]
[16,null,null,{"$f":"VLOOKUP(C25,Legende!D6:E15,2,FALSE)","v":{"$error":"#N/A"}},{"$nulls":5},"Pfad wählen",{"$nulls":6},"Pfad wählen"]
[17,null,null,{"$f":"VLOOKUP(C26,Legende!D6:E15,2,FALSE)","v":{"$error":"#N/A"}},{"$nulls":5},"Pfad wählen",{"$nulls":6},"Pfad wählen"]
[18,null,null,{"$f":"VLOOKUP(C27,Legende!D6:E15,2,FALSE)","v":{"$error":"#N/A"}},{"$nulls":5},"Pfad wählen",{"$nulls":6},"Pfad wählen"]
[19,null,null,{"$f":"VLOOKUP(C28,Legende!D6:E15,2,FALSE)","v":{"$error":"#N/A"}},{"$nulls":5},"Pfad wählen",{"$nulls":6},"Pfad wählen"]
[20,null,null,{"$f":"VLOOKUP(C29,Legende!D6:E15,2,FALSE)","v":{"$error":"#N/A"}},{"$nulls":5},"Pfad wählen",{"$nulls":6},"Pfad wählen"]
[21,null,null,{"$f":"VLOOKUP(C30,Legende!D6:E15,2,FALSE)","v":{"$error":"#N/A"}},{"$nulls":5},"Pfad wählen",{"$nulls":6},"Pfad wählen"]

{"sheet":"4.Installation","index":8,"n_rows":29,"n_cols":20,"rows_kept":29,"merged":[[0,0,3,4],[0,5,3,7],[0,8,3,11],[0,13,0,15],[0,17,0,20],[1,13,1,15],[1,17,1,20],[2,13,2,15],[2,17,2,20],[3,13,3,20],[4,0,4,1],[4,2,4,5],[4,6,7,9],[4,10,6,12],[4,13,7,16],[4,17,6,20],[5,0,5,1],[5,2,5,5],[6,0,6,1],[6,2,6,5],[7,0,8,0],[7,1,8,1],[7,2,8,3],[7,4,8,4],[7,5,8,5],[7,10,7,12],[7,17,7,20],[8,19,8,20],[9,19,9,20],[10,19,10,20],[11,19,11,20],[12,19,12,20],[13,19,13,20],[14,19,14,20],[15,19,15,20],[16,19,16,20],[17,19,17,20],[18,19,18,20],[19,19,19,20],[20,19,20,20],[21,19,21,20],[22,19,22,20],[23,19,23,20],[24,19,24,20],[25,19,25,20],[26,19,26,20],[27,19,27,20],[28,19,28,20]]}
[{"$nulls":5},"Risikobeurteilung nach\nDIN EN ISO 12100:2011\nDIN EN ISO 13849",null,null,"Erstellt durch:",{"$nulls":3},"Name:",{"$f":"Deckblatt!D24","v":0},null,null,"Name:",{"$f":"Deckblatt!D25","v":0}]
[{"$nulls":12},"Name:",{"$f":"Deckblatt!D26","v":0},null,null,"Name:",{"$f":"Deckblatt!D27","v":0}]
[{"$nulls":12},"Name:",{"$f":"Deckblatt!D28","v":0},null,null,"Name:",{"$f":"Deckblatt!D29","v":0}]
[{"$nulls":12},"Datum",{"$f":"Deckblatt!E4","v":"00:00:00"}]
["Projekt",null,{"$f":"Deckblatt!D7","v":0}]
["Müller Modell-Nr",null,{"$f":"Deckblatt!D8","v":0}]
["Lebensphase",null,"4. Installation"]
["Lfd-Nr.","Beschreibung der gefahrbringenden Situation","Gefährdungsart",null,"Gefährdungsursprung","Folgen",{"$nulls":4},"Maßnahmen",{"$nulls":6},"Maßnahme umgesetzt/wirksam"]
[{"$nulls":6},"S","F","P","Grenzrisiko\nGrenze=B","Konstruktiv","Schutzmaßnahmen","Benutzerinformationen","S","F","P","Grenzrisiko\nGrenze=B","J","N","Bemerkungen Belege/Nachweise"]
[1,null,"Elektrische_Gefährdung",{"$f":"VLOOKUP(C10,Legende!D6:E15,2,FALSE)","v":"B"},"Elektrische Gefährdung","Folgen von elektrischen Gefährdungen","S1","F1","P1",{"$f":"IF(AND(G10=\"S1\",H10=\"F1\",I10=\"P1\"),\"Risiko A\",IF(AND(G10=\"S1\",H10=\"F1\",I10=\"P2\"),\"Risiko B\",IF(AND(G10=\"S1\",H10=\"F2\",I10=\"P1\"),\"Risiko B\",IF(AND(G10=\"S1\",H10=\"F2\",I10=\"P2\"),\"Risiko C\",IF(AND(G10=\"S2\",H10=\"F1\",I10=\"P1\"),\"Risiko C\",IF(AND(G10=\"S2\",H10=\"F1\",I10=\"P2\"),\"Risiko D\",IF(AND(G10=\"S2\",H10=\"F2\",I10=\"P1\"),\"Risiko D\",IF(AND(G10=\"S2\",H10=\"F2\",I10=\"P2\"),\"Risiko E\",\"Pfad wählen\"))))))))","v":"Risiko A"},{"$nulls":3},"S1","F1","P1",{"$f":"IF(AND(N10=\"S1\",O10=\"F1\",P10=\"P1\"),\"Risiko A\",IF(AND(N10=\"S1\",O10=\"F1\",P10=\"P2\"),\"Risiko B\",IF(AND(N10=\"S1\",O10=\"F2\",P10=\"P1\"),\"Risiko B\",IF(AND(N10=\"S1\",O10=\"F2\",P10=\"P2\"),\"Risiko C\",IF(AND(N10=\"S2\",O10=\"F1\",P10=\"P1\"),\"Risiko C\",IF(AND(N10=\"S2\",O10=\"F1\",P10=\"P2\"),\"Risiko D\",IF(AND(N10=\"S2\",O10=\"F2\",P10=\"P1\"),\"Risiko D\",IF(AND(N10=\"S2\",O10=\"F2\",P10=\"P2\"),\"Risiko E\",\"Pfad wählen\"))))))))","v":"Risiko A"}]
[{"$f":"#REF!+1","v":{"$error":"#REF!"}},null,"Mechanische_Gefährdung",{"$f":"VLOOKUP(C11,Legende!D3:E12,2,FALSE)","v":"A"},"Mechanische Gefährdung","Quetschen","S1","F1","P1",{"$f":"IF(AND(G11=\"S1\",H11=\"F1\",I11=\"P1\"),\"Risiko A\",IF(AND(G11=\"S1\",H11=\"F1\",I11=\"P2\"),\"Risiko B\",IF(AND(G11=\"S1\",H11=\"F2\",I11=\"P1\"),\"Risiko B\",IF(AND(G11=\"S1\",H11=\"F2\",I11=\"P2\"),\"Risiko C\",IF(AND(G11=\"S2\",H11=\"F1\",I11=\"P1\"),\"Risiko C\",IF(AND(G11=\"S2\",H11=\"F1\",I11=\"P2\"),\"Risiko D\",IF(AND(G11=\"S2\",H11=\"F2\",I11=\"P1\"),\"Risiko D\",IF(AND(G11=\"S2\",H11=\"F2\",I11=\"P2\"),\"Risiko E\",\"Pfad wählen\"))))))))","v":"Risiko A"},{"$nulls":3},"S1","F1","P1","Risiko A"]
[{"$f":"A11+1","v":{"$error":"#REF!"}},null,"Mechanische_Gefährdung",{"$f":"VLOOKUP(C12,Legende!D6:E15,2,FALSE)","v":"A"},"Mechanische Gefährdung","Schneiden oder Abschneiden","S1","F1","P1","Risiko A",{"$nulls":3},"S1","F1","P1","Risiko A"]
[{"$error":"#REF!"},null,"Mechanische_Gefährdung",{"$f":"VLOOKUP(C13,Legende!D6:E15,2,FALSE)","v":"A"},"Höhe gegenüber Boden","Quetschen","S1","F1","P1","Risiko A",{"$nulls":3},"S1","F1","P1","Risiko A"]
[{"$error":"#REF!"},null,null,{"$f":"VLOOKUP(C14,Legende!D6:E15,2,FALSE)","v":{"$error":"#N/A"}},{"$nulls":5},"Pfad wählen",{"$nulls":6},"Pfad wählen"]
[{"$error":"#REF!"},{"$nulls":8},"Pfad wählen",{"$nulls":6},"Pfad wählen"]
[{"$error":"#REF!"},{"$nulls":8},"Pfad wählen",{"$nulls":6},"Pfad wählen"]
[{"$error":"#REF!"},null,null,{"$f":"VLOOKUP(C17,Legende!D6:E15,2,FALSE)","v":{"$error":"#N/A"}},{"$nulls":5},"Pfad wählen",{"$nulls":6},"Pfad wählen"]
[{"$error":"#REF!"},null,null,{"$f":"VLOOKUP(C18,Legende!D6:E15,2,FALSE)","v":{"$error":"#N/A"}},{"$nulls":5},"Pfad wählen",{"$nulls":6},"Pfad wählen"]
[{"$error":"#REF!"},null,null,{"$f":"VLOOKUP(C19,Legende!D6:E15,2,FALSE)","v":{"$error":"#N/A"}},{"$nulls":5},"Pfad wählen",{"$nulls":6},"Pfad wählen"]
[{"$error":"#REF!"},null,null,{"$f":"VLOOKUP(C20,Legende!D6:E15,2,FALSE)","v":{"$error":"#N/A"}},{"$nulls":5},"Pfad wählen",{"$nulls":6},"Pfad wählen"]
[{"$error":"#REF!"},null,null,{"$f":"VLOOKUP(C21,Legende!D6:E15,2,FALSE)","v":{"$error":"#N/A"}},{"$nulls":5},"Pfad wählen",{"$nulls":6},"Pfad wählen"]
[{"$error":"#REF!"},null,null,{"$f":"VLOOKUP(C22,Legende!D6:E15,2,FALSE)","v":{"$error":"#N/A"}},{"$nulls":5},"Pfad wählen",{"$nulls":6},"Pfad wählen"]
[{"$error":"#REF!"},null,null,{"$f":"VLOOKUP(C23,Legende!D6:E15,2,FALSE)","v":{"$error":"#N/A"}},{"$nulls":5},"Pfad wählen",{"$nulls":6},"Pfad wählen"]
[{"$error":"#REF!"},null,null,{"$f":"VLOOKUP(C24,Legende!D6:E15,2,FALSE)","v":{"$error":"#N/A"}},{"$nulls":5},"Pfad wählen",{"$nulls":6},"Pfad wählen"]
[{"$error":"#REF!"},null,null,{"$f":"VLOOKUP(C25,Legende!D6:E15,2,FALSE)","v":{"$error":"#N/A"}},{"$nulls":5},"Pfad wählen",{"$nulls":6},"Pfad wählen"]
[{"$error":"#REF!"},null,null,{"$f":"VLOOKUP(C26,Legende!D6:E15,2,FALSE)","v":{"$error":"#N/A"}},{"$nulls":5},"Pfad wählen",{"$nulls":6},"Pfad wählen"]
[{"$error":"#REF!"},null,null,{"$f":"VLOOKUP(C27,Legende!D6:E15,2,FALSE)","v":{"$error":"#N/A"}},{"$nulls":5},"Pfad wählen",{"$nulls":6},"Pfad wählen"]
[{"$error":"#REF!"},null,null,{"$f":"VLOOKUP(C28,Legende!D6:E15,2,FALSE)","v":{"$error":"#N/A"}},{"$nulls":5},"Pfad wählen",{"$nulls":6},"Pfad wählen"]
[{"$error":"#REF!"},null,null,{"$f":"VLOOKUP(C29,Legende!D6:E15,2,FALSE)","v":{"$error":"#N/A"}},{"$nulls":5},"Pfad wählen",{"$nulls":6},"Pfad wählen"]

{"sheet":"5.Inbetriebnahme","index":9,"n_rows":29,"n_cols":20,"rows_kept":29,"merged":[[0,0,3,4],[0,5,3,7],[0,8,3,11],[0,13,0,15],[0,17,0,20],[1,13,1,15],[1,17,1,20],[2,13,2,15],[2,17,2,20],[3,13,3,20],[4,0,4,1],[4,2,4,5],[4,6,7,9],[4,10,6,12],[4,13,7,16],[4,17,6,20],[5,0,5,1],[5,2,5,5],[6,0,6,1],[6,2,6,5],[7,0,8,0],[7,1,8,1],[7,2,8,3],[7,4,8,4],[7,5,8,5],[7,10,7,12],[7,17,7,20],[8,19,8,20],[9,19,9,20],[10,19,10,20],[11,19,11,20],[12,19,12,20],[13,19,13,20],[14,19,14,20],[15,19,15,20],[16,19,16,20],[17,19,17,20],[18,19,18,20],[19,19,19,20],[20,19,20,20],[21,19,21,20],[22,19,22,20],[23,19,23,20],[24,19,24,20],[25,19,25,20],[26,19,26,20],[27,19,27,20],[28,19,28,20]]}
[{"$nulls":5},"Risikobeurteilung nach\nDIN EN ISO 12100:2011\nDIN EN ISO 13849",null,null,"Erstellt durch:",{"$nulls":3},"Name:",{"$f":"Deckblatt!D24","v":0},null,null,"Name:",{"$f":"Deckblatt!D25","v":0}]
[{"$nulls":12},"Name:",{"$f":"Deckblatt!D26","v":0},null,null,"Name:",{"$f":"Deckblatt!D27","v":0}]
[{"$nulls":12},"Name:",{"$f":"Deckblatt!D28","v":0},null,null,"Name:",{"$f":"Deckblatt!D29","v":0}]
[{"$nulls":12},"Datum",{"$f":"Deckblatt!E4","v":"00:00:00"}]
["Projekt",null,{"$f":"Deckblatt!D7","v":0}]
["Müller Modell-Nr",null,{"$f":"Deckblatt!D8","v":0}]
["Lebensphase",null,"5. Inbetriebnahme"]
["Lfd-Nr.","Beschreibung der gefahrbringenden Situation","Gefährdungsart",null,"Gefährdungsursprung","Folgen",{"$nulls":4},"Maßnahmen",{"$nulls":6},"Maßnahme umgesetzt/wirksam"]
[{"$nulls":6},"S","F","P","Grenzrisiko\nGrenze=B","Konstruktiv","Schutzmaßnahmen","Benutzerinformationen","S","F","P","Grenzrisiko\nGrenze=B","J","N","Bemerkungen Belege/Nachweise"]
[1,null,"Mechanische_Gefährdung",{"$f":"VLOOKUP(C10,[1]Legende!D6:E15,2,FALSE)","v":"A"},"Mechanische Gefährdung","Quetschen","S1","F1","P1",{"$f":"IF(AND(G10=\"S1\",H10=\"F1\",I10=\"P1\"),\"Risiko A\",IF(AND(G10=\"S1\",H10=\"F1\",I10=\"P2\"),\"Risiko B\",IF(AND(G10=\"S1\",H10=\"F2\",I10=\"P1\"),\"Risiko B\",IF(AND(G10=\"S1\",H10=\"F2\",I10=\"P2\"),\"Risiko C\",IF(AND(G10=\"S2\",H10=\"F1\",I10=\"P1\"),\"Risiko C\",IF(AND(G10=\"S2\",H10=\"F1\",I10=\"P2\"),\"Risiko D\",IF(AND(G10=\"S2\",H10=\"F2\",I10=\"P1\"),\"Risiko D\",IF(AND(G10=\"S2\",H10=\"F2\",I10=\"P2\"),\"Risiko E\",\"Pfad wählen\"))))))))","v":"Risiko A"},{"$nulls":3},"S1","F1","P1",{"$f":"IF(AND(N10=\"S1\",O10=\"F1\",P10=\"P1\"),\"Risiko A\",IF(AND(N10=\"S1\",O10=\"F1\",P10=\"P2\"),\"Risiko B\",IF(AND(N10=\"S1\",O10=\"F2\",P10=\"P1\"),\"Risiko B\",IF(AND(N10=\"S1\",O10=\"F2\",P10=\"P2\"),\"Risiko C\",IF(AND(N10=\"S2\",O10=\"F1\",P10=\"P1\"),\"Risiko C\",IF(AND(N10=\"S2\",O10=\"F1\",P10=\"P2\"),\"Risiko D\",IF(AND(N10=\"S2\",O10=\"F2\",P10=\"P1\"),\"Risiko D\",IF(AND(N10=\"S2\",O10=\"F2\",P10=\"P2\"),\"Risiko E\",\"Pfad wählen\"))))))))","v":"Risiko A"}]
[{"$f":"A10+1","v":2},null,"Mechanische_Gefährdung",{"$f":"VLOOKUP(C11,[1]Legende!D6:E15,2,FALSE)","v":"A"},"Mechanische Gefährdung","Quetschen","S1","F1","P1",{"$f":"IF(AND(G11=\"S1\",H11=\"F1\",I11=\"P1\"),\"Risiko A\",IF(AND(G11=\"S1\",H11=\"F1\",I11=\"P2\"),\"Risiko B\",IF(AND(G11=\"S1\",H11=\"F2\",I11=\"P1\"),\"Risiko B\",IF(AND(G11=\"S1\",H11=\"F2\",I11=\"P2\"),\"Risiko C\",IF(AND(G11=\"S2\",H11=\"F1\",I11=\"P1\"),\"Risiko C\",IF(AND(G11=\"S2\",H11=\"F1\",I11=\"P2\"),\"Risiko D\",IF(AND(G11=\"S2\",H11=\"F2\",I11=\"P1\"),\"Risiko D\",IF(AND(G11=\"S2\",H11=\"F2\",I11=\"P2\"),\"Risiko E\",\"Pfad wählen\"))))))))","v":"Risiko A"},{"$nulls":3},"S1","F1","P1",{"$f":"IF(AND(N11=\"S1\",O11=\"F1\",P11=\"P1\"),\"Risiko A\",IF(AND(N11=\"S1\",O11=\"F1\",P11=\"P2\"),\"Risiko B\",IF(AND(N11=\"S1\",O11=\"F2\",P11=\"P1\"),\"Risiko B\",IF(AND(N11=\"S1\",O11=\"F2\",P11=\"P2\"),\"Risiko C\",IF(AND(N11=\"S2\",O11=\"F1\",P11=\"P1\"),\"Risiko C\",IF(AND(N11=\"S2\",O11=\"F1\",P11=\"P2\"),\"Risiko D\",IF(AND(N11=\"S2\",O11=\"F2\",P11=\"P1\"),\"Risiko D\",IF(AND(N11=\"S2\",O11=\"F2\",P11=\"P2\"),\"Risiko E\",\"Pfad wählen\"))))))))","v":"Risiko A"}]
[{"$f":"A11+1","v":3},null,"Elektrische_Gefährdung",{"$f":"VLOOKUP(C12,[1]Legende!D6:E15,2,FALSE)","v":"B"},"Elektrische Gefährdung","(elektrischer) Schlag","S1","F1","P1","Risiko A",{"$nulls":3},"S1","F1","P1","Risiko A"]
[{"$f":"#REF!+1","v":{"$error":"#REF!"}},null,"Elektrische_Gefährdung",{"$f":"VLOOKUP(C13,[1]Legende!D6:E15,2,FALSE)","v":"B"},"spannungsführende Teile","tödlicher Stromschlag","S1","F1","P1","Risiko A",{"$nulls":3},"S1","F1","P1","Risiko A"]
[{"$f":"A13+1","v":{"$error":"#REF!"}},null,"Kombination_von_Gefährdungen",{"$f":"VLOOKUP(C14,[1]Legende!D6:E15,2,FALSE)","v":"J"},"Allgemeine Verletzungsgefahr","Allgemeine Verletzungen","S1","F1","P1","Risiko A",{"$nulls":3},"S1","F1","P1","Risiko A"]
[{"$error":"#REF!"},null,null,{"$f":"VLOOKUP(C15,[1]Legende!D6:E15,2,FALSE)","v":{"$error":"#N/A"}},{"$nulls":5},"Pfad wählen",{"$nulls":6},"Pfad wählen"]
[{"$error":"#REF!"},null,null,{"$f":"VLOOKUP(C16,Legende!D6:E15,2,FALSE)","v":{"$error":"#N/A"}},{"$nulls":5},"Pfad wählen",{"$nulls":6},"Pfad wählen"]
[{"$error":"#REF!"},null,null,{"$f":"VLOOKUP(C17,Legende!D6:E15,2,FALSE)","v":{"$error":"#N/A"}},{"$nulls":5},"Pfad wählen",{"$nulls":6},"Pfad wählen"]
[{"$error":"#REF!"},null,null,{"$f":"VLOOKUP(C18,Legende!D6:E15,2,FALSE)","v":{"$error":"#N/A"}},{"$nulls":5},"Pfad wählen",{"$nulls":6},"Pfad wählen"]
[{"$error":"#REF!"},null,null,{"$f":"VLOOKUP(C19,Legende!D6:E15,2,FALSE)","v":{"$error":"#N/A"}},{"$nulls":5},"Pfad wählen",{"$nulls":6},"Pfad wählen"]
[{"$error":"#REF!"},null,null,{"$f":"VLOOKUP(C20,Legende!D6:E15,2,FALSE)","v":{"$error":"#N/A"}},{"$nulls":5},"Pfad wählen",{"$nulls":6},"Pfad wählen"]
[{"$error":"#REF!"},null,null,{"$f":"VLOOKUP(C21,Legende!D6:E15,2,FALSE)","v":{"$error":"#N/A"}},{"$nulls":5},"Pfad wählen",{"$nulls":6},"Pfad wählen"]
[{"$error":"#REF!"},null,null,{"$f":"VLOOKUP(C22,Legende!D6:E15,2,FALSE)","v":{"$error":"#N/A"}},{"$nulls":5},"Pfad wählen",{"$nulls":6},"Pfad wählen"]
[{"$error":"#REF!"},null,null,{"$f":"VLOOKUP(C23,Legende!D6:E15,2,FALSE)","v":{"$error":"#N/A"}},{"$nulls":5},"Pfad wählen",{"$nulls":6},"Pfad wählen"]
[{"$error":"#REF!"},null,null,{"$f":"VLOOKUP(C24,Legende!D6:E15,2,FALSE)","v":{"$error":"#N/A"}},{"$nulls":5},"Pfad wählen",{"$nulls":6},"Pfad wählen"]
[{"$error":"#REF!"},null,null,{"$f":"VLOOKUP(C25,Legende!D6:E15,2,FALSE)","v":{"$error":"#N/A"}},{"$nulls":5},"Pfad wählen",{"$nulls":6},"Pfad wählen"]
[{"$error":"#REF!"},null,null,{"$f":"VLOOKUP(C26,Legende!D6:E15,2,FALSE)","v":{"$error":"#N/A"}},{"$nulls":5},"Pfad wählen",{"$nulls":6},"Pfad wählen"]
[{"$error":"#REF!"},null,null,{"$f":"VLOOKUP(C27,Legende!D6:E15,2,FALSE)","v":{"$error":"#N/A"}},{"$nulls":5},"Pfad wählen",{"$nulls":6},"Pfad wählen"]
[{"$error":"#REF!"},null,null,{"$f":"VLOOKUP(C28,Legende!D6:E15,2,FALSE)","v":{"$error":"#N/A"}},{"$nulls":5},"Pfad wählen",{"$nulls":6},"Pfad wählen"]
[{"$error":"#REF!"},null,null,{"$f":"VLOOKUP(C29,Legende!D6:E15,2,FALSE)","v":{"$error":"#N/A"}},{"$nulls":5},"Pfad wählen",{"$nulls":6},"Pfad wählen"]

{"sheet":"6.Betrieb","index":10,"n_rows":31,"n_cols":20,"rows_kept":31,"merged":[[0,0,3,4],[0,5,3,7],[0,8,3,11],[0,13,0,15],[0,17,0,20],[1,13,1,15],[1,17,1,20],[2,13,2,15],[2,17,2,20],[3,13,3,20],[4,0,4,1],[4,2,4,5],[4,6,7,9],[4,10,6,12],[4,13,7,16],[4,17,6,20],[5,0,5,1],[5,2,5,5],[6,0,6,1],[6,2,6,5],[7,0,8,0],[7,1,8,1],[7,2,8,3],[7,4,8,4],[7,5,8,5],[7,10,7,12],[7,17,7,20],[8,19,8,20],[9,19,9,20],[10,19,10,20],[11,19,11,20],[12,19,12,20],[13,19,13,20],[14,19,14,20],[15,19,15,20],[16,19,16,20],[17,19,17,20],[18,19,18,20],[19,19,19,20],[20,19,20,20],[21,19,21,20],[22,19,22,20],[23,19,23,20],[24,19,24,20],[25,19,25,20],[26,19,26,20],[27,19,27,20],[28,19,28,20],[29,19,29,20],[30,19,30,20]]}
[{"$nulls":5},"Risikobeurteilung nach\nDIN EN ISO 12100:2011\nDIN EN ISO 13849",null,null,"Erstellt durch:",{"$nulls":3},"Name:",{"$f":"Deckblatt!D24","v":0},null,null,"Name:",{"$f":"Deckblatt!D25","v":0}]
[{"$nulls":12},"Name:",{"$f":"Deckblatt!D26","v":0},null,null,"Name:",{"$f":"Deckblatt!D27","v":0}]
[{"$nulls":12},"Name:",{"$f":"Deckblatt!D28","v":0},null,null,"Name:",{"$f":"Deckblatt!D29","v":0}]
[{"$nulls":12},"Datum",{"$f":"Deckblatt!E4","v":"00:00:00"}]
["Projekt",null,{"$f":"Deckblatt!D7","v":0}]
["Müller Modell-Nr",null,{"$f":"Deckblatt!D8","v":0}]
["Lebensphase",null,"6.Betrieb"]
["Lfd-Nr.","Beschreibung der gefahrbringenden Situation","Gefährdungsart",null,"Gefährdungsursprung","Folgen",{"$nulls":4},"Maßnahmen",{"$nulls":6},"Maßnahme umgesetzt/wirksam"]
[{"$nulls":6},"S","F","P","Grenzrisiko\nGrenze=B","Konstruktiv","Schutzmaßnahmen","Benutzerinformationen","S","F","P","Grenzrisiko\nGrenze=B","J","N","Bemerkungen Belege/Nachweise"]
[1,null,"Mechanische_Gefährdung",{"$f":"VLOOKUP(C10,Legende!D6:E15,2,FALSE)","v":"A"},"Mechanische Gefährdung","Stoßen","S1","F1","P1",{"$f":"IF(AND(G10=\"S1\",H10=\"F1\",I10=\"P1\"),\"Risiko A\",IF(AND(G10=\"S1\",H10=\"F1\",I10=\"P2\"),\"Risiko B\",IF(AND(G10=\"S1\",H10=\"F2\",I10=\"P1\"),\"Risiko B\",IF(AND(G10=\"S1\",H10=\"F2\",I10=\"P2\"),\"Risiko C\",IF(AND(G10=\"S2\",H10=\"F1\",I10=\"P1\"),\"Risiko C\",IF(AND(G10=\"S2\",H10=\"F1\",I10=\"P2\"),\"Risiko D\",IF(AND(G10=\"S2\",H10=\"F2\",I10=\"P1\"),\"Risiko D\",IF(AND(G10=\"S2\",H10=\"F2\",I10=\"P2\"),\"Risiko E\",\"Pfad wählen\"))))))))","v":"Risiko A"},{"$nulls":3},"S1","F1","P1",{"$f":"IF(AND(N10=\"S1\",O10=\"F1\",P10=\"P1\"),\"Risiko A\",IF(AND(N10=\"S1\",O10=\"F1\",P10=\"P2\"),\"Risiko B\",IF(AND(N10=\"S1\",O10=\"F2\",P10=\"P1\"),\"Risiko B\",IF(AND(N10=\"S1\",O10=\"F2\",P10=\"P2\"),\"Risiko C\",IF(AND(N10=\"S2\",O10=\"F1\",P10=\"P1\"),\"Risiko C\",IF(AND(N10=\"S2\",O10=\"F1\",P10=\"P2\"),\"Risiko D\",IF(AND(N10=\"S2\",O10=\"F2\",P10=\"P1\"),\"Risiko D\",IF(AND(N10=\"S2\",O10=\"F2\",P10=\"P2\"),\"Risiko E\",\"Pfad wählen\"))))))))","v":"Risiko A"}]
[{"$f":"A10+1","v":2},null,"Gefährdungen_durch_Lärm",{"$f":"VLOOKUP(C11,Legende!D6:E15,2,FALSE)","v":"D"},"Betrieb der Maschine erzeugt Lärm","Schwerhörigkeit","S1","F1","P1",{"$f":"IF(AND(G11=\"S1\",H11=\"F1\",I11=\"P1\"),\"Risiko A\",IF(AND(G11=\"S1\",H11=\"F1\",I11=\"P2\"),\"Risiko B\",IF(AND(G11=\"S1\",H11=\"F2\",I11=\"P1\"),\"Risiko B\",IF(AND(G11=\"S1\",H11=\"F2\",I11=\"P2\"),\"Risiko C\",IF(AND(G11=\"S2\",H11=\"F1\",I11=\"P1\"),\"Risiko C\",IF(AND(G11=\"S2\",H11=\"F1\",I11=\"P2\"),\"Risiko D\",IF(AND(G11=\"S2\",H11=\"F2\",I11=\"P1\"),\"Risiko D\",IF(AND(G11=\"S2\",H11=\"F2\",I11=\"P2\"),\"Risiko E\",\"Pfad wählen\"))))))))","v":"Risiko A"},{"$nulls":3},"S1","F2","P1","Risiko B"]
[{"$f":"A11+1","v":3},null,"Gefährdungen_durch_Strahlung",{"$f":"VLOOKUP(C12,Legende!D6:E15,2,FALSE)","v":"F"},"elekromagnetische Strahlung","Physische Beeinträchtigung(Kopfschmerzen,Schlaflosigkeit)","S1","F1","P1","Risiko A",{"$nulls":3},"S1","F2","P1","Risiko B"]
[{"$f":"A12+1","v":4},null,"Kombination_von_Gefährdungen",{"$f":"VLOOKUP(C13,Legende!D6:E15,2,FALSE)","v":"J"},"Allgemeine Verletzungsgefahr","Allgemeine Verletzungen","S1","F1","P1","Risiko A",{"$nulls":3},"S1","F2","P1","Risiko B"]
[5,null,"Mechanische_Gefährdung",{"$f":"VLOOKUP(C14,[2]Legende!D6:E15,2,FALSE)","v":"A"},"rotierendene Teile","Einziehen oder Fangen","S1","F1","P1","Risiko A",{"$nulls":3},"S1","F1","P1","Risiko A"]
[{"$f":"A14+1","v":6},null,"Mechanische_Gefährdung",{"$f":"VLOOKUP(C15,Legende!D6:E15,2,FALSE)","v":"A"},"herab fallende Gegenstände","Quetschen","S1","F1","P1","Risiko A",{"$nulls":3},"S1","F1","P1","Risiko A"]
[7,null,null,{"$f":"VLOOKUP(C16,Legende!D6:E15,2,FALSE)","v":{"$error":"#N/A"}},{"$nulls":5},"Pfad wählen",{"$nulls":6},"Pfad wählen"]
[8,null,null,{"$f":"VLOOKUP(C17,Legende!D6:E15,2,FALSE)","v":{"$error":"#N/A"}},{"$nulls":5},"Pfad wählen",{"$nulls":6},"Pfad wählen"]
[9,null,null,{"$f":"VLOOKUP(C18,Legende!D6:E15,2,FALSE)","v":{"$error":"#N/A"}},{"$nulls":5},"Pfad wählen",{"$nulls":6},"Pfad wählen"]
[10,null,null,{"$f":"VLOOKUP(C19,Legende!D6:E15,2,FALSE)","v":{"$error":"#N/A"}},{"$nulls":5},"Pfad wählen",{"$nulls":6},"Pfad wählen"]
[11,null,null,{"$f":"VLOOKUP(C20,Legende!D6:E15,2,FALSE)","v":{"$error":"#N/A"}},{"$nulls":5},"Pfad wählen",{"$nulls":6},"Pfad wählen"]
[12,null,null,{"$f":"VLOOKUP(C21,Legende!D6:E15,2,FALSE)","v":{"$error":"#N/A"}},{"$nulls":5},"Pfad wählen",{"$nulls":6},"Pfad wählen"]
[13,null,null,{"$f":"VLOOKUP(C22,Legende!D6:E15,2,FALSE)","v":{"$error":"#N/A"}},{"$nulls":5},"Pfad wählen",{"$nulls":6},"Pfad wählen"]
[14,null,null,{"$f":"VLOOKUP(C23,Legende!D6:E15,2,FALSE)","v":{"$error":"#N/A"}},{"$nulls":5},"Pfad wählen",{"$nulls":6},"Pfad wählen"]
[15,null,null,{"$f":"VLOOKUP(C24,Legende!D6:E15,2,FALSE)","v":{"$error":"#N/A"}},{"$nulls":5},"Pfad wählen",{"$nulls":6},"Pfad wählen"]
[16,null,null,{"$f":"VLOOKUP(C25,Legende!D6:E15,2,FALSE)","v":{"$error":"#N/A"}},{"$nulls":5},"Pfad wählen",{"$nulls":6},"Pfad wählen"]
[17,null,null,{"$f":"VLOOKUP(C26,Legende!D6:E15,2,FALSE)","v":{"$error":"#N/A"}},{"$nulls":5},"Pfad wählen",{"$nulls":6},"Pfad wählen"]
[18,null,null,{"$f":"VLOOKUP(C27,Legende!D6:E15,2,FALSE)","v":{"$error":"#N/A"}},{"$nulls":5},"Pfad wählen",{"$nulls":6},"Pfad wählen"]
[19,null,null,{"$f":"VLOOKUP(C28,Legende!D6:E15,2,FALSE)","v":{"$error":"#N/A"}},{"$nulls":5},"Pfad wählen",{"$nulls":6},"Pfad wählen"]
[20,null,null,{"$f":"VLOOKUP(C29,Legende!D6:E15,2,FALSE)","v":{"$error":"#N/A"}},{"$nulls":5},"Pfad wählen",{"$nulls":6},"Pfad wählen"]
[21,null,null,{"$f":"VLOOKUP(C30,Legende!D6:E15,2,FALSE)","v":{"$error":"#N/A"}},{"$nulls":5},"Pfad wählen",{"$nulls":6},"Pfad wählen"]
[22,null,null,{"$f":"VLOOKUP(C31,Legende!D6:E15,2,FALSE)","v":{"$error":"#N/A"}},{"$nulls":5},"Pfad wählen",{"$nulls":6},"Pfad wählen"]

{"sheet":"7.Außerbetriebnahme","index":11,"n_rows":32,"n_cols":20,"rows_kept":32,"merged":[[0,0,3,4],[0,5,3,7],[0,8,3,11],[0,13,0,15],[0,17,0,20],[1,13,1,15],[1,17,1,20],[2,13,2,15],[2,17,2,20],[3,13,3,20],[4,0,4,1],[4,2,4,5],[4,6,7,9],[4,10,6,12],[4,13,7,16],[4,17,6,20],[5,0,5,1],[5,2,5,5],[6,0,6,1],[6,2,6,5],[7,0,8,0],[7,1,8,1],[7,2,8,3],[7,4,8,4],[7,5,8,5],[7,10,7,12],[7,17,7,20],[8,19,8,20],[9,19,9,20],[10,19,10,20],[11,19,11,20],[12,19,12,20],[13,19,13,20],[14,19,14,20],[15,19,15,20],[16,19,16,20],[17,19,17,20],[18,19,18,20],[19,19,19,20],[20,19,20,20],[21,19,21,20],[22,19,22,20],[23,19,23,20],[24,19,24,20],[25,19,25,20],[26,19,26,20],[27,19,27,20],[28,19,28,20],[29,19,29,20],[30,19,30,20],[31,19,31,20]]}
[{"$nulls":5},"Risikobeurteilung nach\nDIN EN ISO 12100:2011\nDIN EN ISO 13849",null,null,"Erstellt durch:",{"$nulls":3},"Name:",{"$f":"Deckblatt!D24","v":0},null,null,"Name:",{"$f":"Deckblatt!D25","v":0}]
[{"$nulls":12},"Name:",{"$f":"Deckblatt!D26","v":0},null,null,"Name:",{"$f":"Deckblatt!D27","v":0}]
[{"$nulls":12},"Name:",{"$f":"Deckblatt!D28","v":0},null,null,"Name:",{"$f":"Deckblatt!D29","v":0}]
[{"$nulls":12},"Datum",{"$f":"Deckblatt!E4","v":"00:00:00"}]
["Projekt",null,{"$f":"Deckblatt!D7","v":0}]
["Müller Modell-Nr",null,{"$f":"Deckblatt!D8","v":0}]
["Lebensphase",null,"7.Außerbetriebnahme"]
["Lfd-Nr.","Beschreibung der gefahrbringenden Situation","Gefährdungsart",null,"Gefährdungsursprung","Folgen",{"$nulls":4},"Maßnahmen",{"$nulls":6},"Maßnahme umgesetzt/wirksam"]
[{"$nulls":6},"S","F","P","Grenzrisiko\nGrenze=B","Konstruktiv","Schutzmaßnahmen","Benutzerinformationen","S","F","P","Grenzrisiko\nGrenze=B","J","N","Bemerkungen Belege/Nachweise"]
[1,null,"Mechanische_Gefährdung",{"$f":"VLOOKUP(C10,Legende!D6:E15,2,FALSE)","v":"A"},"Mechanische Gefährdung","Quetschen","S1","F1","P1",{"$f":"IF(AND(G10=\"S1\",H10=\"F1\",I10=\"P1\"),\"Risiko A\",IF(AND(G10=\"S1\",H10=\"F1\",I10=\"P2\"),\"Risiko B\",IF(AND(G10=\"S1\",H10=\"F2\",I10=\"P1\"),\"Risiko B\",IF(AND(G10=\"S1\",H10=\"F2\",I10=\"P2\"),\"Risiko C\",IF(AND(G10=\"S2\",H10=\"F1\",I10=\"P1\"),\"Risiko C\",IF(AND(G10=\"S2\",H10=\"F1\",I10=\"P2\"),\"Risiko D\",IF(AND(G10=\"S2\",H10=\"F2\",I10=\"P1\"),\"Risiko D\",IF(AND(G10=\"S2\",H10=\"F2\",I10=\"P2\"),\"Risiko E\",\"Pfad wählen\"))))))))","v":"Risiko A"},{"$nulls":3},"S1","F1","P1",{"$f":"IF(AND(N10=\"S1\",O10=\"F1\",P10=\"P1\"),\"Risiko A\",IF(AND(N10=\"S1\",O10=\"F1\",P10=\"P2\"),\"Risiko B\",IF(AND(N10=\"S1\",O10=\"F2\",P10=\"P1\"),\"Risiko B\",IF(AND(N10=\"S1\",O10=\"F2\",P10=\"P2\"),\"Risiko C\",IF(AND(N10=\"S2\",O10=\"F1\",P10=\"P1\"),\"Risiko C\",IF(AND(N10=\"S2\",O10=\"F1\",P10=\"P2\"),\"Risiko D\",IF(AND(N10=\"S2\",O10=\"F2\",P10=\"P1\"),\"Risiko D\",IF(AND(N10=\"S2\",O10=\"F2\",P10=\"P2\"),\"Risiko E\",\"Pfad wählen\"))))))))","v":"Risiko A"}]
[{"$f":"A10+1","v":2},null,"Mechanische_Gefährdung",{"$f":"VLOOKUP(C11,[1]Legende!D6:E15,2,FALSE)","v":"A"},"Mechanische Gefährdung","Quetschen","S1","F1","P1",{"$f":"IF(AND(G11=\"S1\",H11=\"F1\",I11=\"P1\"),\"Risiko A\",IF(AND(G11=\"S1\",H11=\"F1\",I11=\"P2\"),\"Risiko B\",IF(AND(G11=\"S1\",H11=\"F2\",I11=\"P1\"),\"Risiko B\",IF(AND(G11=\"S1\",H11=\"F2\",I11=\"P2\"),\"Risiko C\",IF(AND(G11=\"S2\",H11=\"F1\",I11=\"P1\"),\"Risiko C\",IF(AND(G11=\"S2\",H11=\"F1\",I11=\"P2\"),\"Risiko D\",IF(AND(G11=\"S2\",H11=\"F2\",I11=\"P1\"),\"Risiko D\",IF(AND(G11=\"S2\",H11=\"F2\",I11=\"P2\"),\"Risiko E\",\"Pfad wählen\"))))))))","v":"Risiko A"},{"$nulls":3},"S1","F1","P1",{"$f":"IF(AND(N11=\"S1\",O11=\"F1\",P11=\"P1\"),\"Risiko A\",IF(AND(N11=\"S1\",O11=\"F1\",P11=\"P2\"),\"Risiko B\",IF(AND(N11=\"S1\",O11=\"F2\",P11=\"P1\"),\"Risiko B\",IF(AND(N11=\"S1\",O11=\"F2\",P11=\"P2\"),\"Risiko C\",IF(AND(N11=\"S2\",O11=\"F1\",P11=\"P1\"),\"Risiko C\",IF(AND(N11=\"S2\",O11=\"F1\",P11=\"P2\"),\"Risiko D\",IF(AND(N11=\"S2\",O11=\"F2\",P11=\"P1\"),\"Risiko D\",IF(AND(N11=\"S2\",O11=\"F2\",P11=\"P2\"),\"Risiko E\",\"Pfad wählen\"))))))))","v":"Risiko A"}]
[{"$f":"A11+1","v":3},null,"Elektrische_Gefährdung",{"$f":"VLOOKUP(C12,Legende!D6:E15,2,FALSE)","v":"B"},"Elektrische Gefährdung","(elektrischer) Schlag","S1","F1","P1",{"$f":"IF(AND(G12=\"S1\",H12=\"F1\",I12=\"P1\"),\"Risiko A\",IF(AND(G12=\"S1\",H12=\"F1\",I12=\"P2\"),\"Risiko B\",IF(AND(G12=\"S1\",H12=\"F2\",I12=\"P1\"),\"Risiko B\",IF(AND(G12=\"S1\",H12=\"F2\",I12=\"P2\"),\"Risiko C\",IF(AND(G12=\"S2\",H12=\"F1\",I12=\"P1\"),\"Risiko C\",IF(AND(G12=\"S2\",H12=\"F1\",I12=\"P2\"),\"Risiko D\",IF(AND(G12=\"S2\",H12=\"F2\",I12=\"P1\"),\"Risiko D\",IF(AND(G12=\"S2\",H12=\"F2\",I12=\"P2\"),\"Risiko E\",\"Pfad wählen\"))))))))","v":"Risiko A"},{"$nulls":3},"S1","F1","P1",{"$f":"IF(AND(N12=\"S1\",O12=\"F1\",P12=\"P1\"),\"Risiko A\",IF(AND(N12=\"S1\",O12=\"F1\",P12=\"P2\"),\"Risiko B\",IF(AND(N12=\"S1\",O12=\"F2\",P12=\"P1\"),\"Risiko B\",IF(AND(N12=\"S1\",O12=\"F2\",P12=\"P2\"),\"Risiko C\",IF(AND(N12=\"S2\",O12=\"F1\",P12=\"P1\"),\"Risiko C\",IF(AND(N12=\"S2\",O12=\"F1\",P12=\"P2\"),\"Risiko D\",IF(AND(N12=\"S2\",O12=\"F2\",P12=\"P1\"),\"Risiko D\",IF(AND(N12=\"S2\",O12=\"F2\",P12=\"P2\"),\"Risiko E\",\"Pfad wählen\"))))))))","v":"Risiko A"}]
[{"$f":"A12+1","v":4},null,"Elektrische_Gefährdung",{"$f":"VLOOKUP(C13,Legende!D6:E15,2,FALSE)","v":"B"},"spannungsführende Teile","Folgen von elektrischen Gefährdungen","S1","F1","P1",{"$f":"IF(AND(G13=\"S1\",H13=\"F1\",I13=\"P1\"),\"Risiko A\",IF(AND(G13=\"S1\",H13=\"F1\",I13=\"P2\"),\"Risiko B\",IF(AND(G13=\"S1\",H13=\"F2\",I13=\"P1\"),\"Risiko B\",IF(AND(G13=\"S1\",H13=\"F2\",I13=\"P2\"),\"Risiko C\",IF(AND(G13=\"S2\",H13=\"F1\",I13=\"P1\"),\"Risiko C\",IF(AND(G13=\"S2\",H13=\"F1\",I13=\"P2\"),\"Risiko D\",IF(AND(G13=\"S2\",H13=\"F2\",I13=\"P1\"),\"Risiko D\",IF(AND(G13=\"S2\",H13=\"F2\",I13=\"P2\"),\"Risiko E\",\"Pfad wählen\"))))))))","v":"Risiko A"},{"$nulls":3},"S1","F1","P1",{"$f":"IF(AND(N13=\"S1\",O13=\"F1\",P13=\"P1\"),\"Risiko A\",IF(AND(N13=\"S1\",O13=\"F1\",P13=\"P2\"),\"Risiko B\",IF(AND(N13=\"S1\",O13=\"F2\",P13=\"P1\"),\"Risiko B\",IF(AND(N13=\"S1\",O13=\"F2\",P13=\"P2\"),\"Risiko C\",IF(AND(N13=\"S2\",O13=\"F1\",P13=\"P1\"),\"Risiko C\",IF(AND(N13=\"S2\",O13=\"F1\",P13=\"P2\"),\"Risiko D\",IF(AND(N13=\"S2\",O13=\"F2\",P13=\"P1\"),\"Risiko D\",IF(AND(N13=\"S2\",O13=\"F2\",P13=\"P2\"),\"Risiko E\",\"Pfad wählen\"))))))))","v":"Risiko A"}]
[{"$f":"#REF!+1","v":{"$error":"#REF!"}},null,null,{"$f":"VLOOKUP(C14,Legende!D6:E15,2,FALSE)","v":{"$error":"#N/A"}},{"$nulls":5},{"$f":"IF(AND(G14=\"S1\",H14=\"F1\",I14=\"P1\"),\"Risiko A\",IF(AND(G14=\"S1\",H14=\"F1\",I14=\"P2\"),\"Risiko B\",IF(AND(G14=\"S1\",H14=\"F2\",I14=\"P1\"),\"Risiko B\",IF(AND(G14=\"S1\",H14=\"F2\",I14=\"P2\"),\"Risiko C\",IF(AND(G14=\"S2\",H14=\"F1\",I14=\"P1\"),\"Risiko C\",IF(AND(G14=\"S2\",H14=\"F1\",I14=\"P2\"),\"Risiko D\",IF(AND(G14=\"S2\",H14=\"F2\",I14=\"P1\"),\"Risiko D\",IF(AND(G14=\"S2\",H14=\"F2\",I14=\"P2\"),\"Risiko E\",\"Pfad wählen\"))))))))","v":"Pfad wählen"},{"$nulls":6},"Pfad wählen"]
[{"$f":"A14+1","v":{"$error":"#REF!"}},null,null,{"$f":"VLOOKUP(C15,Legende!D6:E15,2,FALSE)","v":{"$error":"#N/A"}},{"$nulls":5},"Pfad wählen",{"$nulls":6},"Pfad wählen"]
[{"$error":"#REF!"},null,null,{"$f":"VLOOKUP(C16,Legende!D6:E15,2,FALSE)","v":{"$error":"#N/A"}},{"$nulls":5},"Pfad wählen",{"$nulls":6},"Pfad wählen"]
[{"$error":"#REF!"},null,null,{"$f":"VLOOKUP(C17,Legende!D6:E15,2,FALSE)","v":{"$error":"#N/A"}},{"$nulls":5},"Pfad wählen",{"$nulls":6},"Pfad wählen"]
[{"$error":"#REF!"},null,null,{"$f":"VLOOKUP(C18,Legende!D6:E15,2,FALSE)","v":{"$error":"#N/A"}},{"$nulls":5},"Pfad wählen",{"$nulls":6},"Pfad wählen"]
[{"$error":"#REF!"},null,null,{"$f":"VLOOKUP(C19,Legende!D6:E15,2,FALSE)","v":{"$error":"#N/A"}},{"$nulls":5},"Pfad wählen",{"$nulls":6},"Pfad wählen"]
[{"$error":"#REF!"},null,null,{"$f":"VLOOKUP(C20,Legende!D6:E15,2,FALSE)","v":{"$error":"#N/A"}},{"$nulls":5},"Pfad wählen",{"$nulls":6},"Pfad wählen"]
[{"$error":"#REF!"},null,null,{"$f":"VLOOKUP(C21,Legende!D6:E15,2,FALSE)","v":{"$error":"#N/A"}},{"$nulls":5},"Pfad wählen",{"$nulls":6},"Pfad wählen"]
[{"$error":"#REF!"},null,null,{"$f":"VLOOKUP(C22,Legende!D6:E15,2,FALSE)","v":{"$error":"#N/A"}},{"$nulls":5},"Pfad wählen",{"$nulls":6},"Pfad wählen"]
[{"$error":"#REF!"},null,null,{"$f":"VLOOKUP(C23,Legende!D6:E15,2,FALSE)","v":{"$error":"#N/A"}},{"$nulls":5},"Pfad wählen",{"$nulls":6},"Pfad wählen"]
[{"$error":"#REF!"},null,null,{"$f":"VLOOKUP(C24,Legende!D6:E15,2,FALSE)","v":{"$error":"#N/A"}},{"$nulls":5},"Pfad wählen",{"$nulls":6},"Pfad wählen"]
[{"$error":"#REF!"},null,null,{"$f":"VLOOKUP(C25,Legende!D6:E15,2,FALSE)","v":{"$error":"#N/A"}},{"$nulls":5},"Pfad wählen",{"$nulls":6},"Pfad wählen"]
[{"$error":"#REF!"},null,null,{"$f":"VLOOKUP(C26,Legende!D6:E15,2,FALSE)","v":{"$error":"#N/A"}},{"$nulls":5},"Pfad wählen",{"$nulls":6},"Pfad wählen"]
[{"$error":"#REF!"},null,null,{"$f":"VLOOKUP(C27,Legende!D6:E15,2,FALSE)","v":{"$error":"#N/A"}},{"$nulls":5},"Pfad wählen",{"$nulls":6},"Pfad wählen"]
[{"$error":"#REF!"},null,null,{"$f":"VLOOKUP(C28,Legende!D6:E15,2,FALSE)","v":{"$error":"#N/A"}},{"$nulls":5},"Pfad wählen",{"$nulls":6},"Pfad wählen"]
[{"$error":"#REF!"},null,null,{"$f":"VLOOKUP(C29,Legende!D6:E15,2,FALSE)","v":{"$error":"#N/A"}},{"$nulls":5},"Pfad wählen",{"$nulls":6},"Pfad wählen"]
[{"$error":"#REF!"},null,null,{"$f":"VLOOKUP(C30,Legende!D6:E15,2,FALSE)","v":{"$error":"#N/A"}},{"$nulls":5},"Pfad wählen",{"$nulls":6},"Pfad wählen"]
[{"$error":"#REF!"},null,null,{"$f":"VLOOKUP(C31,Legende!D6:E15,2,FALSE)","v":{"$error":"#N/A"}},{"$nulls":5},"Pfad wählen",{"$nulls":6},"Pfad wählen"]
[{"$error":"#REF!"},null,null,{"$f":"VLOOKUP(C32,Legende!D6:E15,2,FALSE)","v":{"$error":"#N/A"}},{"$nulls":5},"Pfad wählen",{"$nulls":6},"Pfad wählen"]

{"sheet":"8.Reinigung","index":12,"n_rows":29,"n_cols":20,"rows_kept":29,"merged":[[0,0,3,4],[0,5,3,7],[0,8,3,11],[0,13,0,15],[0,17,0,20],[1,13,1,15],[1,17,1,20],[2,13,2,15],[2,17,2,20],[3,13,3,20],[4,0,4,1],[4,2,4,5],[4,6,7,9],[4,10,6,12],[4,13,7,16],[4,17,6,20],[5,0,5,1],[5,2,5,5],[6,0,6,1],[6,2,6,5],[7,0,8,0],[7,1,8,1],[7,2,8,3],[7,4,8,4],[7,5,8,5],[7,10,7,12],[7,17,7,20],[8,19,8,20],[9,19,9,20],[10,19,10,20],[11,19,11,20],[12,19,12,20],[13,19,13,20],[14,19,14,20],[15,19,15,20],[16,19,16,20],[17,19,17,20],[18,19,18,20],[19,19,19,20],[20,19,20,20],[21,19,21,20],[22,19,22,20],[23,19,23,20],[24,19,24,20],[25,19,25,20],[26,19,26,20],[27,19,27,20],[28,19,28,20]]}
[{"$nulls":5},"Risikobeurteilung nach\nDIN EN ISO 12100:2011\nDIN EN ISO 13849",null,null,"Erstellt durch:",{"$nulls":3},"Name:",{"$f":"Deckblatt!D24","v":0},null,null,"Name:",{"$f":"Deckblatt!D25","v":0}]
[{"$nulls":12},"Name:",{"$f":"Deckblatt!D26","v":0},null,null,"Name:",{"$f":"Deckblatt!D27","v":0}]
[{"$nulls":12},"Name:",{"$f":"Deckblatt!D28","v":0},null,null,"Name:",{"$f":"Deckblatt!D29","v":0}]
[{"$nulls":12},"Datum",{"$f":"Deckblatt!E4","v":"00:00:00"}]
["Projekt",null,{"$f":"Deckblatt!D7","v":0}]
["Müller Auftrags-Nr",null,{"$f":"Deckblatt!D8","v":0}]
["Lebensphase",null,"8. Reinigung"]
["Lfd-Nr.","Beschreibung der gefahrbringenden Situation","Gefährdungsart",null,"Gefährdungsursprung","Folgen",{"$nulls":4},"Maßnahmen",{"$nulls":6},"Maßnahme umgesetzt/wirksam"]
[{"$nulls":6},"S","F","P","Grenzrisiko\nGrenze=B","Konstruktiv","Schutzmaßnahmen","Benutzerinformationen","S","F","P","Grenzrisiko\nGrenze=B","J","N","Bemerkungen Belege/Nachweise"]
[1,null,"Elektrische_Gefährdung",{"$f":"VLOOKUP(C10,Legende!D6:E15,2,FALSE)","v":"B"},"Elektrische Gefährdung","(elektrischer) Schlag","S1","F1","P1",{"$f":"IF(AND(G10=\"S1\",H10=\"F1\",I10=\"P1\"),\"Risiko A\",IF(AND(G10=\"S1\",H10=\"F1\",I10=\"P2\"),\"Risiko B\",IF(AND(G10=\"S1\",H10=\"F2\",I10=\"P1\"),\"Risiko B\",IF(AND(G10=\"S1\",H10=\"F2\",I10=\"P2\"),\"Risiko C\",IF(AND(G10=\"S2\",H10=\"F1\",I10=\"P1\"),\"Risiko C\",IF(AND(G10=\"S2\",H10=\"F1\",I10=\"P2\"),\"Risiko D\",IF(AND(G10=\"S2\",H10=\"F2\",I10=\"P1\"),\"Risiko D\",IF(AND(G10=\"S2\",H10=\"F2\",I10=\"P2\"),\"Risiko E\",\"Pfad wählen\"))))))))","v":"Risiko A"},{"$nulls":3},"S1","F1","P1",{"$f":"IF(AND(N10=\"S1\",O10=\"F1\",P10=\"P1\"),\"Risiko A\",IF(AND(N10=\"S1\",O10=\"F1\",P10=\"P2\"),\"Risiko B\",IF(AND(N10=\"S1\",O10=\"F2\",P10=\"P1\"),\"Risiko B\",IF(AND(N10=\"S1\",O10=\"F2\",P10=\"P2\"),\"Risiko C\",IF(AND(N10=\"S2\",O10=\"F1\",P10=\"P1\"),\"Risiko C\",IF(AND(N10=\"S2\",O10=\"F1\",P10=\"P2\"),\"Risiko D\",IF(AND(N10=\"S2\",O10=\"F2\",P10=\"P1\"),\"Risiko D\",IF(AND(N10=\"S2\",O10=\"F2\",P10=\"P2\"),\"Risiko E\",\"Pfad wählen\"))))))))","v":"Risiko A"}]
[{"$f":"A10+1","v":2},null,"Gefärdungen_durch_Materialien_und_Substanzen",{"$f":"VLOOKUP(C11,Legende!D6:E15,2,FALSE)","v":"G"},"Flüssigkeit","Korrosion","S1","F1","P1",{"$f":"IF(AND(G11=\"S1\",H11=\"F1\",I11=\"P1\"),\"Risiko A\",IF(AND(G11=\"S1\",H11=\"F1\",I11=\"P2\"),\"Risiko B\",IF(AND(G11=\"S1\",H11=\"F2\",I11=\"P1\"),\"Risiko B\",IF(AND(G11=\"S1\",H11=\"F2\",I11=\"P2\"),\"Risiko C\",IF(AND(G11=\"S2\",H11=\"F1\",I11=\"P1\"),\"Risiko C\",IF(AND(G11=\"S2\",H11=\"F1\",I11=\"P2\"),\"Risiko D\",IF(AND(G11=\"S2\",H11=\"F2\",I11=\"P1\"),\"Risiko D\",IF(AND(G11=\"S2\",H11=\"F2\",I11=\"P2\"),\"Risiko E\",\"Pfad wählen\"))))))))","v":"Risiko A"},{"$nulls":3},"S1","F1","P1","Risiko A"]
[{"$f":"A11+1","v":3},null,"Gefärdungen_durch_Materialien_und_Substanzen",{"$f":"VLOOKUP(C12,Legende!D6:E15,2,FALSE)","v":"G"},"Staub ","Atembeschwerden","S1","F1","P1","Risiko A",{"$nulls":3},"S1","F1","P1","Risiko A"]
[{"$f":"#REF!+1","v":{"$error":"#REF!"}},null,"Mechanische_Gefährdung",{"$f":"VLOOKUP(C13,Legende!D6:E15,2,FALSE)","v":"A"},"Mechanische Gefährdung","Einziehen oder Fangen","S1","F1","P1","Risiko A",{"$nulls":3},"S1","F1","P1","Risiko A"]
[{"$f":"A13+1","v":{"$error":"#REF!"}},null,"Mechanische_Gefährdung",{"$f":"VLOOKUP(C14,Legende!D6:E15,2,FALSE)","v":"A"},"herab fallende Gegenstände","Quetschen","S1","F1","P1","Risiko A",{"$nulls":3},"S1","F1","P1","Risiko A"]
[{"$error":"#REF!"},null,"Kombination_von_Gefährdungen",{"$f":"VLOOKUP(C15,Legende!D6:E15,2,FALSE)","v":"J"},"Allgemeine Verletzungsgefahr","Allgemeine Verletzungen","S1","F1","P1","Risiko A",{"$nulls":3},"S1","F1","P1","Risiko A"]
[{"$error":"#REF!"},null,"Thermische_Gefährdungen",{"$f":"VLOOKUP(C16,Legende!D6:E15,2,FALSE)","v":"CE"},"Objekte hoher oder niedriger Temperatur","Verbrennung","S1","F1","P1","Risiko A",{"$nulls":3},"S1","F1","P1","Risiko A"]
[{"$error":"#REF!"},null,"Elektrische_Gefährdung",{"$f":"VLOOKUP(C17,Legende!D11:E20,2,FALSE)","v":{"$error":"#N/A"}},"spannungsführende Teile","Folgen von elektrischen Gefährdungen","S1","F1","P1",{"$f":"IF(AND(G17=\"S1\",H17=\"F1\",I17=\"P1\"),\"Risiko A\",IF(AND(G17=\"S1\",H17=\"F1\",I17=\"P2\"),\"Risiko B\",IF(AND(G17=\"S1\",H17=\"F2\",I17=\"P1\"),\"Risiko B\",IF(AND(G17=\"S1\",H17=\"F2\",I17=\"P2\"),\"Risiko C\",IF(AND(G17=\"S2\",H17=\"F1\",I17=\"P1\"),\"Risiko C\",IF(AND(G17=\"S2\",H17=\"F1\",I17=\"P2\"),\"Risiko D\",IF(AND(G17=\"S2\",H17=\"F2\",I17=\"P1\"),\"Risiko D\",IF(AND(G17=\"S2\",H17=\"F2\",I17=\"P2\"),\"Risiko E\",\"Pfad wählen\"))))))))","v":"Risiko A"},{"$nulls":3},"S1","F1","P1","Risiko A"]
[{"$error":"#REF!"},null,null,{"$f":"VLOOKUP(C18,Legende!D6:E15,2,FALSE)","v":{"$error":"#N/A"}},{"$nulls":5},"Pfad wählen",{"$nulls":6},"Pfad wählen"]
[{"$error":"#REF!"},null,null,{"$f":"VLOOKUP(C19,Legende!D6:E15,2,FALSE)","v":{"$error":"#N/A"}},{"$nulls":5},"Pfad wählen",{"$nulls":6},"Pfad wählen"]
[{"$error":"#REF!"},null,null,{"$f":"VLOOKUP(C20,Legende!D6:E15,2,FALSE)","v":{"$error":"#N/A"}},{"$nulls":5},"Pfad wählen",{"$nulls":6},"Pfad wählen"]
[{"$error":"#REF!"},null,null,{"$f":"VLOOKUP(C21,Legende!D6:E15,2,FALSE)","v":{"$error":"#N/A"}},{"$nulls":5},"Pfad wählen",{"$nulls":6},"Pfad wählen"]
[{"$error":"#REF!"},null,null,{"$f":"VLOOKUP(C22,Legende!D6:E15,2,FALSE)","v":{"$error":"#N/A"}},{"$nulls":5},"Pfad wählen",{"$nulls":6},"Pfad wählen"]
[{"$error":"#REF!"},null,null,{"$f":"VLOOKUP(C23,Legende!D6:E15,2,FALSE)","v":{"$error":"#N/A"}},{"$nulls":5},"Pfad wählen",{"$nulls":6},"Pfad wählen"]
[{"$error":"#REF!"},null,null,{"$f":"VLOOKUP(C24,Legende!D6:E15,2,FALSE)","v":{"$error":"#N/A"}},{"$nulls":5},"Pfad wählen",{"$nulls":6},"Pfad wählen"]
[{"$error":"#REF!"},null,null,{"$f":"VLOOKUP(C25,Legende!D6:E15,2,FALSE)","v":{"$error":"#N/A"}},{"$nulls":5},"Pfad wählen",{"$nulls":6},"Pfad wählen"]
[{"$error":"#REF!"},null,null,{"$f":"VLOOKUP(C26,Legende!D6:E15,2,FALSE)","v":{"$error":"#N/A"}},{"$nulls":5},"Pfad wählen",{"$nulls":6},"Pfad wählen"]
[{"$error":"#REF!"},null,null,{"$f":"VLOOKUP(C27,Legende!D6:E15,2,FALSE)","v":{"$error":"#N/A"}},{"$nulls":5},"Pfad wählen",{"$nulls":6},"Pfad wählen"]
[{"$error":"#REF!"},null,null,{"$f":"VLOOKUP(C28,Legende!D6:E15,2,FALSE)","v":{"$error":"#N/A"}},{"$nulls":5},"Pfad wählen",{"$nulls":6},"Pfad wählen"]
[{"$error":"#REF!"},null,null,{"$f":"VLOOKUP(C29,Legende!D6:E15,2,FALSE)","v":{"$error":"#N/A"}},{"$nulls":5},"Pfad wählen",{"$nulls":6},"Pfad wählen"]

{"sheet":"9.Wartung","index":13,"n_rows":30,"n_cols":20,"rows_kept":30,"merged":[[0,0,3,4],[0,5,3,7],[0,8,3,11],[0,13,0,15],[0,17,0,20],[1,13,1,15],[1,17,1,20],[2,13,2,15],[2,17,2,20],[3,13,3,20],[4,0,4,1],[4,2,4,5],[4,6,7,9],[4,10,6,12],[4,13,7,16],[4,17,6,20],[5,0,5,1],[5,2,5,5],[6,0,6,1],[6,2,6,5],[7,0,8,0],[7,1,8,1],[7,2,8,3],[7,4,8,4],[7,5,8,5],[7,10,7,12],[7,17,7,20],[8,19,8,20],[9,19,9,20],[10,19,10,20],[11,19,11,20],[12,19,12,20],[13,19,13,20],[14,19,14,20],[15,19,15,20],[16,19,16,20],[17,19,17,20],[18,19,18,20],[19,19,19,20],[20,19,20,20],[21,19,21,20],[22,19,22,20],[23,19,23,20],[24,19,24,20],[25,19,25,20],[26,19,26,20],[27,19,27,20],[28,19,28,20],[29,19,29,20]]}
[{"$nulls":5},"Risikobeurteilung nach\nDIN EN ISO 12100:2011\nDIN EN ISO 13849",null,null,"Erstellt durch:",{"$nulls":3},"Name:",{"$f":"Deckblatt!D24","v":0},null,null,"Name:",{"$f":"Deckblatt!D25","v":0}]
[{"$nulls":12},"Name:",{"$f":"Deckblatt!D26","v":0},null,null,"Name:",{"$f":"Deckblatt!D27","v":0}]
[{"$nulls":12},"Name:",{"$f":"Deckblatt!D28","v":0},null,null,"Name:",{"$f":"Deckblatt!D29","v":0}]
[{"$nulls":12},"Datum",{"$f":"Deckblatt!E4","v":"00:00:00"}]
["Projekt",null,{"$f":"Deckblatt!D7","v":0}]
["Müller Modell-Nr",null,{"$f":"Deckblatt!D8","v":0}]
["Lebensphase",null,"9.Wartung"]
["Lfd-Nr.","Beschreibung der gefahrbringenden Situation","Gefährdungsart",null,"Gefährdungsursprung","Folgen",{"$nulls":4},"Maßnahmen",{"$nulls":6},"Maßnahme umgesetzt/wirksam"]
[{"$nulls":6},"S","F","P","Grenzrisiko\nGrenze=B","Konstruktiv","Schutzmaßnahmen","Benutzerinformationen","S","F","P","Grenzrisiko\nGrenze=B","J","N","Bemerkungen Belege/Nachweise"]
[{"$f":"A9+1","v":1},null,"Mechanische_Gefährdung",{"$f":"VLOOKUP(C10,Legende!D5:E14,2,FALSE)","v":"A"},"Mechanische Gefährdung","Quetschen","S1","F1","P1",{"$f":"IF(AND(G10=\"S1\",H10=\"F1\",I10=\"P1\"),\"Risiko A\",IF(AND(G10=\"S1\",H10=\"F1\",I10=\"P2\"),\"Risiko B\",IF(AND(G10=\"S1\",H10=\"F2\",I10=\"P1\"),\"Risiko B\",IF(AND(G10=\"S1\",H10=\"F2\",I10=\"P2\"),\"Risiko C\",IF(AND(G10=\"S2\",H10=\"F1\",I10=\"P1\"),\"Risiko C\",IF(AND(G10=\"S2\",H10=\"F1\",I10=\"P2\"),\"Risiko D\",IF(AND(G10=\"S2\",H10=\"F2\",I10=\"P1\"),\"Risiko D\",IF(AND(G10=\"S2\",H10=\"F2\",I10=\"P2\"),\"Risiko E\",\"Pfad wählen\"))))))))","v":"Risiko A"},{"$nulls":3},"S1","F1","P1",{"$f":"IF(AND(N10=\"S1\",O10=\"F1\",P10=\"P1\"),\"Risiko A\",IF(AND(N10=\"S1\",O10=\"F1\",P10=\"P2\"),\"Risiko B\",IF(AND(N10=\"S1\",O10=\"F2\",P10=\"P1\"),\"Risiko B\",IF(AND(N10=\"S1\",O10=\"F2\",P10=\"P2\"),\"Risiko C\",IF(AND(N10=\"S2\",O10=\"F1\",P10=\"P1\"),\"Risiko C\",IF(AND(N10=\"S2\",O10=\"F1\",P10=\"P2\"),\"Risiko D\",IF(AND(N10=\"S2\",O10=\"F2\",P10=\"P1\"),\"Risiko D\",IF(AND(N10=\"S2\",O10=\"F2\",P10=\"P2\"),\"Risiko E\",\"Pfad wählen\"))))))))","v":"Risiko A"}]
[{"$f":"A10+1","v":2},null,"Elektrische_Gefährdung",{"$f":"VLOOKUP(C11,Legende!D5:E14,2,FALSE)","v":"B"},"Elektrische Gefährdung","(elektrischer) Schlag","S1","F1","P1","Risiko A",{"$nulls":3},"S1","F1","P1","Risiko A"]
[{"$f":"A11+1","v":3},null,"Kombination_von_Gefährdungen",{"$f":"VLOOKUP(C12,[4]Legende!D6:E15,2,FALSE)","v":"J"},"Allgemeine Verletzungsgefahr","Allgemeine Verletzungen","S1","F1","P1","Risiko A",{"$nulls":3},"S1","F1","P1","Risiko A"]
[{"$f":"A12+1","v":4},null,"Mechanische_Gefährdung",{"$f":"VLOOKUP(C13,Legende!D6:E15,2,FALSE)","v":"A"},"spitze Teile","Schneiden oder Abschneiden","S1","F1","P1",{"$f":"IF(AND(G13=\"S1\",H13=\"F1\",I13=\"P1\"),\"Risiko A\",IF(AND(G13=\"S1\",H13=\"F1\",I13=\"P2\"),\"Risiko B\",IF(AND(G13=\"S1\",H13=\"F2\",I13=\"P1\"),\"Risiko B\",IF(AND(G13=\"S1\",H13=\"F2\",I13=\"P2\"),\"Risiko C\",IF(AND(G13=\"S2\",H13=\"F1\",I13=\"P1\"),\"Risiko C\",IF(AND(G13=\"S2\",H13=\"F1\",I13=\"P2\"),\"Risiko D\",IF(AND(G13=\"S2\",H13=\"F2\",I13=\"P1\"),\"Risiko D\",IF(AND(G13=\"S2\",H13=\"F2\",I13=\"P2\"),\"Risiko E\",\"Pfad wählen\"))))))))","v":"Risiko A"},{"$nulls":3},"S1","F1","P1",{"$f":"IF(AND(N13=\"S1\",O13=\"F1\",P13=\"P1\"),\"Risiko A\",IF(AND(N13=\"S1\",O13=\"F1\",P13=\"P2\"),\"Risiko B\",IF(AND(N13=\"S1\",O13=\"F2\",P13=\"P1\"),\"Risiko B\",IF(AND(N13=\"S1\",O13=\"F2\",P13=\"P2\"),\"Risiko C\",IF(AND(N13=\"S2\",O13=\"F1\",P13=\"P1\"),\"Risiko C\",IF(AND(N13=\"S2\",O13=\"F1\",P13=\"P2\"),\"Risiko D\",IF(AND(N13=\"S2\",O13=\"F2\",P13=\"P1\"),\"Risiko D\",IF(AND(N13=\"S2\",O13=\"F2\",P13=\"P2\"),\"Risiko E\",\"Pfad wählen\"))))))))","v":"Risiko A"}]
[{"$f":"A13+1","v":5},null,"Mechanische_Gefährdung",{"$f":"VLOOKUP(C14,Legende!D5:E14,2,FALSE)","v":"A"},"herab fallende Gegenstände","Quetschen","S1","F1","P1","Risiko A",{"$nulls":3},"S1","F1","P1","Risiko A"]
[6,null,"Mechanische_Gefährdung",{"$f":"VLOOKUP(C15,Legende!D6:E15,2,FALSE)","v":"A"},"Schwerkraft","Quetschen","S1","F1","P1","Risiko A",{"$nulls":3},"S1","F1","P1","Risiko A"]
[{"$f":"#REF!+1","v":{"$error":"#REF!"}},null,"Elektrische_Gefährdung",{"$f":"VLOOKUP(C16,Legende!D10:E19,2,FALSE)","v":{"$error":"#N/A"}},"spannungsführende Teile","Folgen von elektrischen Gefährdungen","S1","F1","P1",{"$f":"IF(AND(G16=\"S1\",H16=\"F1\",I16=\"P1\"),\"Risiko A\",IF(AND(G16=\"S1\",H16=\"F1\",I16=\"P2\"),\"Risiko B\",IF(AND(G16=\"S1\",H16=\"F2\",I16=\"P1\"),\"Risiko B\",IF(AND(G16=\"S1\",H16=\"F2\",I16=\"P2\"),\"Risiko C\",IF(AND(G16=\"S2\",H16=\"F1\",I16=\"P1\"),\"Risiko C\",IF(AND(G16=\"S2\",H16=\"F1\",I16=\"P2\"),\"Risiko D\",IF(AND(G16=\"S2\",H16=\"F2\",I16=\"P1\"),\"Risiko D\",IF(AND(G16=\"S2\",H16=\"F2\",I16=\"P2\"),\"Risiko E\",\"Pfad wählen\"))))))))","v":"Risiko A"},{"$nulls":3},"S1","F1","P1","Risiko A"]
[{"$error":"#REF!"},null,null,{"$f":"VLOOKUP(C17,Legende!D6:E15,2,FALSE)","v":{"$error":"#N/A"}},{"$nulls":5},"Pfad wählen",{"$nulls":6},"Pfad wählen"]
[{"$error":"#REF!"},null,null,{"$f":"VLOOKUP(C18,Legende!D6:E15,2,FALSE)","v":{"$error":"#N/A"}},{"$nulls":5},"Pfad wählen",{"$nulls":6},"Pfad wählen"]
[{"$error":"#REF!"},null,null,{"$f":"VLOOKUP(C19,Legende!D6:E15,2,FALSE)","v":{"$error":"#N/A"}},{"$nulls":5},"Pfad wählen",{"$nulls":6},"Pfad wählen"]
[{"$error":"#REF!"},null,null,{"$f":"VLOOKUP(C20,Legende!D6:E15,2,FALSE)","v":{"$error":"#N/A"}},{"$nulls":5},"Pfad wählen",{"$nulls":6},"Pfad wählen"]
[{"$error":"#REF!"},null,null,{"$f":"VLOOKUP(C21,Legende!D6:E15,2,FALSE)","v":{"$error":"#N/A"}},{"$nulls":5},"Pfad wählen",{"$nulls":6},"Pfad wählen"]
[{"$error":"#REF!"},null,null,{"$f":"VLOOKUP(C22,Legende!D6:E15,2,FALSE)","v":{"$error":"#N/A"}},{"$nulls":5},"Pfad wählen",{"$nulls":6},"Pfad wählen"]
[{"$error":"#REF!"},null,null,{"$f":"VLOOKUP(C23,Legende!D6:E15,2,FALSE)","v":{"$error":"#N/A"}},{"$nulls":5},"Pfad wählen",{"$nulls":6},"Pfad wählen"]
[{"$error":"#REF!"},null,null,{"$f":"VLOOKUP(C24,Legende!D6:E15,2,FALSE)","v":{"$error":"#N/A"}},{"$nulls":5},"Pfad wählen",{"$nulls":6},"Pfad wählen"]
[{"$error":"#REF!"},null,null,{"$f":"VLOOKUP(C25,Legende!D6:E15,2,FALSE)","v":{"$error":"#N/A"}},{"$nulls":5},"Pfad wählen",{"$nulls":6},"Pfad wählen"]
[{"$error":"#REF!"},null,null,{"$f":"VLOOKUP(C26,Legende!D6:E15,2,FALSE)","v":{"$error":"#N/A"}},{"$nulls":5},"Pfad wählen",{"$nulls":6},"Pfad wählen"]
[{"$error":"#REF!"},null,null,{"$f":"VLOOKUP(C27,Legende!D6:E15,2,FALSE)","v":{"$error":"#N/A"}},{"$nulls":5},"Pfad wählen",{"$nulls":6},"Pfad wählen"]
[{"$error":"#REF!"},null,null,{"$f":"VLOOKUP(C28,Legende!D6:E15,2,FALSE)","v":{"$error":"#N/A"}},{"$nulls":5},"Pfad wählen",{"$nulls":6},"Pfad wählen"]
[{"$error":"#REF!"},null,null,{"$f":"VLOOKUP(C29,Legende!D6:E15,2,FALSE)","v":{"$error":"#N/A"}},{"$nulls":5},"Pfad wählen",{"$nulls":6},"Pfad wählen"]
[{"$error":"#REF!"},null,null,{"$f":"VLOOKUP(C30,Legende!D6:E15,2,FALSE)","v":{"$error":"#N/A"}},{"$nulls":5},"Pfad wählen",{"$nulls":6},"Pfad wählen"]

{"sheet":"10.Störungsbeseitigung","index":14,"n_rows":33,"n_cols":20,"rows_kept":33,"merged":[[0,0,3,4],[0,5,3,7],[0,8,3,11],[0,13,0,15],[0,17,0,20],[1,13,1,15],[1,17,1,20],[2,13,2,15],[2,17,2,20],[3,13,3,20],[4,0,4,1],[4,2,4,5],[4,6,7,9],[4,10,6,12],[4,13,7,16],[4,17,6,20],[5,0,5,1],[5,2,5,5],[6,0,6,1],[6,2,6,5],[7,0,8,0],[7,1,8,1],[7,2,8,3],[7,4,8,4],[7,5,8,5],[7,10,7,12],[7,17,7,20],[8,19,8,20],[9,19,9,20],[10,19,10,20],[11,19,11,20],[12,19,12,20],[13,19,13,20],[14,19,14,20],[15,19,15,20],[16,19,16,20],[17,19,17,20],[18,19,18,20],[19,19,19,20],[20,19,20,20],[21,19,21,20],[22,19,22,20],[23,19,23,20],[24,19,24,20],[25,19,25,20],[26,19,26,20],[27,19,27,20],[28,19,28,20],[29,19,29,20],[30,19,30,20],[31,19,31,20],[32,19,32,20]]}
[{"$nulls":5},"Risikobeurteilung nach\nDIN EN ISO 12100:2011\nDIN EN ISO 13849",null,null,"Erstellt durch:",{"$nulls":3},"Name:",{"$f":"Deckblatt!D24","v":0},null,null,"Name:",{"$f":"Deckblatt!D25","v":0}]
[{"$nulls":12},"Name:",{"$f":"Deckblatt!D26","v":0},null,null,"Name:",{"$f":"Deckblatt!D27","v":0}]
[{"$nulls":12},"Name:",{"$f":"Deckblatt!D28","v":0},null,null,"Name:",{"$f":"Deckblatt!D29","v":0}]
[{"$nulls":12},"Datum",{"$f":"Deckblatt!E4","v":"00:00:00"}]
["Projekt",null,{"$f":"Deckblatt!D7","v":0}]
["Müller Modell-Nr",null,{"$f":"Deckblatt!D8","v":0}]
["Lebensphase",null,"10. Störungsbeseitigung/Reparatur"]
["Lfd-Nr.","Beschreibung der gefahrbringenden Situation","Gefährdungsart",null,"Gefährdungsursprung","Folgen",{"$nulls":4},"Maßnahmen",{"$nulls":6},"Maßnahme umgesetzt/wirksam"]
[{"$nulls":6},"S","F","P","Grenzrisiko\nGrenze=B","Konstruktiv","Schutzmaßnahmen","Benutzerinformationen","S","F","P","Grenzrisiko\nGrenze=B","J","N","Bemerkungen Belege/Nachweise"]
[1,null,"Mechanische_Gefährdung",{"$f":"VLOOKUP(C10,Legende!D6:E15,2,FALSE)","v":"A"},"Mechanische Gefährdung","Quetschen","S1","F1","P1",{"$f":"IF(AND(G10=\"S1\",H10=\"F1\",I10=\"P1\"),\"Risiko A\",IF(AND(G10=\"S1\",H10=\"F1\",I10=\"P2\"),\"Risiko B\",IF(AND(G10=\"S1\",H10=\"F2\",I10=\"P1\"),\"Risiko B\",IF(AND(G10=\"S1\",H10=\"F2\",I10=\"P2\"),\"Risiko C\",IF(AND(G10=\"S2\",H10=\"F1\",I10=\"P1\"),\"Risiko C\",IF(AND(G10=\"S2\",H10=\"F1\",I10=\"P2\"),\"Risiko D\",IF(AND(G10=\"S2\",H10=\"F2\",I10=\"P1\"),\"Risiko D\",IF(AND(G10=\"S2\",H10=\"F2\",I10=\"P2\"),\"Risiko E\",\"Pfad wählen\"))))))))","v":"Risiko A"},{"$nulls":3},"S1","F1","P1",{"$f":"IF(AND(N10=\"S1\",O10=\"F1\",P10=\"P1\"),\"Risiko A\",IF(AND(N10=\"S1\",O10=\"F1\",P10=\"P2\"),\"Risiko B\",IF(AND(N10=\"S1\",O10=\"F2\",P10=\"P1\"),\"Risiko B\",IF(AND(N10=\"S1\",O10=\"F2\",P10=\"P2\"),\"Risiko C\",IF(AND(N10=\"S2\",O10=\"F1\",P10=\"P1\"),\"Risiko C\",IF(AND(N10=\"S2\",O10=\"F1\",P10=\"P2\"),\"Risiko D\",IF(AND(N10=\"S2\",O10=\"F2\",P10=\"P1\"),\"Risiko D\",IF(AND(N10=\"S2\",O10=\"F2\",P10=\"P2\"),\"Risiko E\",\"Pfad wählen\"))))))))","v":"Risiko A"}]
[{"$f":"A10+1","v":2},null,"Mechanische_Gefährdung",{"$f":"VLOOKUP(C11,Legende!D6:E15,2,FALSE)","v":"A"},"Mechanische Gefährdung","Quetschen","S1","F1","P1",{"$f":"IF(AND(G11=\"S1\",H11=\"F1\",I11=\"P1\"),\"Risiko A\",IF(AND(G11=\"S1\",H11=\"F1\",I11=\"P2\"),\"Risiko B\",IF(AND(G11=\"S1\",H11=\"F2\",I11=\"P1\"),\"Risiko B\",IF(AND(G11=\"S1\",H11=\"F2\",I11=\"P2\"),\"Risiko C\",IF(AND(G11=\"S2\",H11=\"F1\",I11=\"P1\"),\"Risiko C\",IF(AND(G11=\"S2\",H11=\"F1\",I11=\"P2\"),\"Risiko D\",IF(AND(G11=\"S2\",H11=\"F2\",I11=\"P1\"),\"Risiko D\",IF(AND(G11=\"S2\",H11=\"F2\",I11=\"P2\"),\"Risiko E\",\"Pfad wählen\"))))))))","v":"Risiko A"},{"$nulls":3},"S1","F1","P1",{"$f":"IF(AND(N11=\"S1\",O11=\"F1\",P11=\"P1\"),\"Risiko A\",IF(AND(N11=\"S1\",O11=\"F1\",P11=\"P2\"),\"Risiko B\",IF(AND(N11=\"S1\",O11=\"F2\",P11=\"P1\"),\"Risiko B\",IF(AND(N11=\"S1\",O11=\"F2\",P11=\"P2\"),\"Risiko C\",IF(AND(N11=\"S2\",O11=\"F1\",P11=\"P1\"),\"Risiko C\",IF(AND(N11=\"S2\",O11=\"F1\",P11=\"P2\"),\"Risiko D\",IF(AND(N11=\"S2\",O11=\"F2\",P11=\"P1\"),\"Risiko D\",IF(AND(N11=\"S2\",O11=\"F2\",P11=\"P2\"),\"Risiko E\",\"Pfad wählen\"))))))))","v":"Risiko A"}]
[{"$f":"A11+1","v":3},null,"Elektrische_Gefährdung",{"$f":"VLOOKUP(C12,Legende!D6:E15,2,FALSE)","v":"B"},"Elektrische Gefährdung","(elektrischer) Schlag","S1","F1","P1","Risiko A",{"$nulls":3},"S1","F1","P1","Risiko A"]
[{"$f":"A12+1","v":4},null,"Mechanische_Gefährdung",{"$f":"VLOOKUP(C13,Legende!D6:E15,2,FALSE)","v":"A"},"sich bewegende Teile","Einziehen oder Fangen","S1","F1","P1",{"$f":"IF(AND(G13=\"S1\",H13=\"F1\",I13=\"P1\"),\"Risiko A\",IF(AND(G13=\"S1\",H13=\"F1\",I13=\"P2\"),\"Risiko B\",IF(AND(G13=\"S1\",H13=\"F2\",I13=\"P1\"),\"Risiko B\",IF(AND(G13=\"S1\",H13=\"F2\",I13=\"P2\"),\"Risiko C\",IF(AND(G13=\"S2\",H13=\"F1\",I13=\"P1\"),\"Risiko C\",IF(AND(G13=\"S2\",H13=\"F1\",I13=\"P2\"),\"Risiko D\",IF(AND(G13=\"S2\",H13=\"F2\",I13=\"P1\"),\"Risiko D\",IF(AND(G13=\"S2\",H13=\"F2\",I13=\"P2\"),\"Risiko E\",\"Pfad wählen\"))))))))","v":"Risiko A"},{"$nulls":3},"S1","F1","P1",{"$f":"IF(AND(N13=\"S1\",O13=\"F1\",P13=\"P1\"),\"Risiko A\",IF(AND(N13=\"S1\",O13=\"F1\",P13=\"P2\"),\"Risiko B\",IF(AND(N13=\"S1\",O13=\"F2\",P13=\"P1\"),\"Risiko B\",IF(AND(N13=\"S1\",O13=\"F2\",P13=\"P2\"),\"Risiko C\",IF(AND(N13=\"S2\",O13=\"F1\",P13=\"P1\"),\"Risiko C\",IF(AND(N13=\"S2\",O13=\"F1\",P13=\"P2\"),\"Risiko D\",IF(AND(N13=\"S2\",O13=\"F2\",P13=\"P1\"),\"Risiko D\",IF(AND(N13=\"S2\",O13=\"F2\",P13=\"P2\"),\"Risiko E\",\"Pfad wählen\"))))))))","v":"Risiko A"}]
[{"$f":"A13+1","v":5},null,null,{"$f":"VLOOKUP(C14,Legende!D2:E11,2,FALSE)","v":{"$error":"#N/A"}},{"$nulls":5},{"$f":"IF(AND(G14=\"S1\",H14=\"F1\",I14=\"P1\"),\"Risiko A\",IF(AND(G14=\"S1\",H14=\"F1\",I14=\"P2\"),\"Risiko B\",IF(AND(G14=\"S1\",H14=\"F2\",I14=\"P1\"),\"Risiko B\",IF(AND(G14=\"S1\",H14=\"F2\",I14=\"P2\"),\"Risiko C\",IF(AND(G14=\"S2\",H14=\"F1\",I14=\"P1\"),\"Risiko C\",IF(AND(G14=\"S2\",H14=\"F1\",I14=\"P2\"),\"Risiko D\",IF(AND(G14=\"S2\",H14=\"F2\",I14=\"P1\"),\"Risiko D\",IF(AND(G14=\"S2\",H14=\"F2\",I14=\"P2\"),\"Risiko E\",\"Pfad wählen\"))))))))","v":"Pfad wählen"},{"$nulls":6},"Pfad wählen"]
[{"$f":"A14+1","v":6},null,null,{"$f":"VLOOKUP(C15,Legende!D6:E15,2,FALSE)","v":{"$error":"#N/A"}},{"$nulls":5},{"$f":"IF(AND(G15=\"S1\",H15=\"F1\",I15=\"P1\"),\"Risiko A\",IF(AND(G15=\"S1\",H15=\"F1\",I15=\"P2\"),\"Risiko B\",IF(AND(G15=\"S1\",H15=\"F2\",I15=\"P1\"),\"Risiko B\",IF(AND(G15=\"S1\",H15=\"F2\",I15=\"P2\"),\"Risiko C\",IF(AND(G15=\"S2\",H15=\"F1\",I15=\"P1\"),\"Risiko C\",IF(AND(G15=\"S2\",H15=\"F1\",I15=\"P2\"),\"Risiko D\",IF(AND(G15=\"S2\",H15=\"F2\",I15=\"P1\"),\"Risiko D\",IF(AND(G15=\"S2\",H15=\"F2\",I15=\"P2\"),\"Risiko E\",\"Pfad wählen\"))))))))","v":"Pfad wählen"},{"$nulls":6},"Pfad wählen"]
[{"$f":"A15+1","v":7},null,null,{"$f":"VLOOKUP(C16,Legende!D6:E15,2,FALSE)","v":{"$error":"#N/A"}},{"$nulls":5},"Pfad wählen",{"$nulls":6},"Pfad wählen"]
[8,null,null,{"$f":"VLOOKUP(C17,Legende!D6:E15,2,FALSE)","v":{"$error":"#N/A"}},{"$nulls":5},"Pfad wählen",{"$nulls":6},"Pfad wählen"]
[9,null,null,{"$f":"VLOOKUP(C18,Legende!D6:E15,2,FALSE)","v":{"$error":"#N/A"}},{"$nulls":5},"Pfad wählen",{"$nulls":6},"Pfad wählen"]
[10,null,null,{"$f":"VLOOKUP(C19,Legende!D6:E15,2,FALSE)","v":{"$error":"#N/A"}},{"$nulls":5},"Pfad wählen",{"$nulls":6},"Pfad wählen"]
[11,null,null,{"$f":"VLOOKUP(C20,Legende!D6:E15,2,FALSE)","v":{"$error":"#N/A"}},{"$nulls":5},"Pfad wählen",{"$nulls":6},"Pfad wählen"]
[12,null,null,{"$f":"VLOOKUP(C21,Legende!D6:E15,2,FALSE)","v":{"$error":"#N/A"}},{"$nulls":5},"Pfad wählen",{"$nulls":6},"Pfad wählen"]
[13,null,null,{"$f":"VLOOKUP(C22,Legende!D6:E15,2,FALSE)","v":{"$error":"#N/A"}},{"$nulls":5},"Pfad wählen",{"$nulls":6},"Pfad wählen"]
[14,null,null,{"$f":"VLOOKUP(C23,Legende!D6:E15,2,FALSE)","v":{"$error":"#N/A"}},{"$nulls":5},"Pfad wählen",{"$nulls":6},"Pfad wählen"]
[15,null,null,{"$f":"VLOOKUP(C24,Legende!D6:E15,2,FALSE)","v":{"$error":"#N/A"}},{"$nulls":5},"Pfad wählen",{"$nulls":6},"Pfad wählen"]
[16,null,null,{"$f":"VLOOKUP(C25,Legende!D6:E15,2,FALSE)","v":{"$error":"#N/A"}},{"$nulls":5},"Pfad wählen",{"$nulls":6},"Pfad wählen"]
[17,null,null,{"$f":"VLOOKUP(C26,Legende!D6:E15,2,FALSE)","v":{"$error":"#N/A"}},{"$nulls":5},"Pfad wählen",{"$nulls":6},"Pfad wählen"]
[18,null,null,{"$f":"VLOOKUP(C27,Legende!D6:E15,2,FALSE)","v":{"$error":"#N/A"}},{"$nulls":5},"Pfad wählen",{"$nulls":6},"Pfad wählen"]
[19,null,null,{"$f":"VLOOKUP(C28,Legende!D6:E15,2,FALSE)","v":{"$error":"#N/A"}},{"$nulls":5},"Pfad wählen",{"$nulls":6},"Pfad wählen"]
[20,null,null,{"$f":"VLOOKUP(C29,Legende!D6:E15,2,FALSE)","v":{"$error":"#N/A"}},{"$nulls":5},"Pfad wählen",{"$nulls":6},"Pfad wählen"]
[21,null,null,{"$f":"VLOOKUP(C30,Legende!D6:E15,2,FALSE)","v":{"$error":"#N/A"}},{"$nulls":5},"Pfad wählen",{"$nulls":6},"Pfad wählen"]
[22,null,null,{"$f":"VLOOKUP(C31,Legende!D6:E15,2,FALSE)","v":{"$error":"#N/A"}},{"$nulls":5},"Pfad wählen",{"$nulls":6},"Pfad wählen"]
[23,null,null,{"$f":"VLOOKUP(C32,Legende!D6:E15,2,FALSE)","v":{"$error":"#N/A"}},{"$nulls":5},"Pfad wählen",{"$nulls":6},"Pfad wählen"]
[24,null,null,{"$f":"VLOOKUP(C33,Legende!D6:E15,2,FALSE)","v":{"$error":"#N/A"}},{"$nulls":5},"Pfad wählen",{"$nulls":6},"Pfad wählen"]

{"sheet":"11.Entsorgung","index":15,"n_rows":30,"n_cols":20,"rows_kept":30,"merged":[[0,0,3,4],[0,5,3,7],[0,8,3,11],[0,13,0,15],[0,17,0,20],[1,13,1,15],[1,17,1,20],[2,13,2,15],[2,17,2,20],[3,13,3,20],[4,0,4,1],[4,2,4,5],[4,6,7,9],[4,10,6,12],[4,13,7,16],[4,17,6,20],[5,0,5,1],[5,2,5,5],[6,0,6,1],[6,2,6,5],[7,0,8,0],[7,1,8,1],[7,2,8,3],[7,4,8,4],[7,5,8,5],[7,10,7,12],[7,17,7,20],[8,19,8,20],[9,19,9,20],[10,19,10,20],[11,19,11,20],[12,19,12,20],[13,19,13,20],[14,19,14,20],[15,19,15,20],[16,19,16,20],[17,19,17,20],[18,19,18,20],[19,19,19,20],[20,19,20,20],[21,19,21,20],[22,19,22,20],[23,19,23,20],[24,19,24,20],[25,19,25,20],[26,19,26,20],[27,19,27,20],[28,19,28,20],[29,19,29,20]]}
[{"$nulls":5},"Risikobeurteilung nach\nDIN EN ISO 12100:2011\nDIN EN ISO 13849",null,null,"Erstellt durch:",{"$nulls":3},"Name:",{"$f":"Deckblatt!D24","v":0},null,null,"Name:",{"$f":"Deckblatt!D25","v":0}]
[{"$nulls":12},"Name:",{"$f":"Deckblatt!D26","v":0},null,null,"Name:",{"$f":"Deckblatt!D27","v":0}]
[{"$nulls":12},"Name:",{"$f":"Deckblatt!D28","v":0},null,null,"Name:",{"$f":"Deckblatt!D29","v":0}]
[{"$nulls":12},"Datum",{"$f":"Deckblatt!E4","v":"00:00:00"}]
["Projekt",null,{"$f":"Deckblatt!D7","v":0}]
["Müller Modell-Nr",null,{"$f":"Deckblatt!D8","v":0}]
["Lebensphase",null,"11. Entsorgung"]
["Lfd-Nr.","Beschreibung der gefahrbringenden Situation","Gefährdungsart",null,"Gefährdungsursprung","Folgen",{"$nulls":4},"Maßnahmen",{"$nulls":6},"Maßnahme umgesetzt/wirksam"]
[{"$nulls":6},"S","F","P","Grenzrisiko\nGrenze=B","Konstruktiv","Schutzmaßnahmen","Benutzerinformationen","S","F","P","Grenzrisiko\nGrenze=B","J","N","Bemerkungen Belege/Nachweise"]
[1,null,"Mechanische_Gefährdung",{"$f":"VLOOKUP(C10,Legende!D6:E15,2,FALSE)","v":"A"},"Schwerkraft","Quetschen","S1","F1","P1",{"$f":"IF(AND(G10=\"S1\",H10=\"F1\",I10=\"P1\"),\"Risiko A\",IF(AND(G10=\"S1\",H10=\"F1\",I10=\"P2\"),\"Risiko B\",IF(AND(G10=\"S1\",H10=\"F2\",I10=\"P1\"),\"Risiko B\",IF(AND(G10=\"S1\",H10=\"F2\",I10=\"P2\"),\"Risiko C\",IF(AND(G10=\"S2\",H10=\"F1\",I10=\"P1\"),\"Risiko C\",IF(AND(G10=\"S2\",H10=\"F1\",I10=\"P2\"),\"Risiko D\",IF(AND(G10=\"S2\",H10=\"F2\",I10=\"P1\"),\"Risiko D\",IF(AND(G10=\"S2\",H10=\"F2\",I10=\"P2\"),\"Risiko E\",\"Pfad wählen\"))))))))","v":"Risiko A"},{"$nulls":3},"S1","F1","P1",{"$f":"IF(AND(N10=\"S1\",O10=\"F1\",P10=\"P1\"),\"Risiko A\",IF(AND(N10=\"S1\",O10=\"F1\",P10=\"P2\"),\"Risiko B\",IF(AND(N10=\"S1\",O10=\"F2\",P10=\"P1\"),\"Risiko B\",IF(AND(N10=\"S1\",O10=\"F2\",P10=\"P2\"),\"Risiko C\",IF(AND(N10=\"S2\",O10=\"F1\",P10=\"P1\"),\"Risiko C\",IF(AND(N10=\"S2\",O10=\"F1\",P10=\"P2\"),\"Risiko D\",IF(AND(N10=\"S2\",O10=\"F2\",P10=\"P1\"),\"Risiko D\",IF(AND(N10=\"S2\",O10=\"F2\",P10=\"P2\"),\"Risiko E\",\"Pfad wählen\"))))))))","v":"Risiko A"}]
[{"$f":"A10+1","v":2},null,"Gefärdungen_durch_Materialien_und_Substanzen",{"$f":"VLOOKUP(C11,[5]Legende!D6:E15,2,FALSE)","v":"G"},"Giftige Substanzen","Vergiftung","S1","F1","P1",{"$f":"IF(AND(G11=\"S1\",H11=\"F1\",I11=\"P1\"),\"Risiko A\",IF(AND(G11=\"S1\",H11=\"F1\",I11=\"P2\"),\"Risiko B\",IF(AND(G11=\"S1\",H11=\"F2\",I11=\"P1\"),\"Risiko B\",IF(AND(G11=\"S1\",H11=\"F2\",I11=\"P2\"),\"Risiko C\",IF(AND(G11=\"S2\",H11=\"F1\",I11=\"P1\"),\"Risiko C\",IF(AND(G11=\"S2\",H11=\"F1\",I11=\"P2\"),\"Risiko D\",IF(AND(G11=\"S2\",H11=\"F2\",I11=\"P1\"),\"Risiko D\",IF(AND(G11=\"S2\",H11=\"F2\",I11=\"P2\"),\"Risiko E\",\"Pfad wählen\"))))))))","v":"Risiko A"},{"$nulls":3},"S1","F1","P1",{"$f":"IF(AND(N11=\"S1\",O11=\"F1\",P11=\"P1\"),\"Risiko A\",IF(AND(N11=\"S1\",O11=\"F1\",P11=\"P2\"),\"Risiko B\",IF(AND(N11=\"S1\",O11=\"F2\",P11=\"P1\"),\"Risiko B\",IF(AND(N11=\"S1\",O11=\"F2\",P11=\"P2\"),\"Risiko C\",IF(AND(N11=\"S2\",O11=\"F1\",P11=\"P1\"),\"Risiko C\",IF(AND(N11=\"S2\",O11=\"F1\",P11=\"P2\"),\"Risiko D\",IF(AND(N11=\"S2\",O11=\"F2\",P11=\"P1\"),\"Risiko D\",IF(AND(N11=\"S2\",O11=\"F2\",P11=\"P2\"),\"Risiko E\",\"Pfad wählen\"))))))))","v":"Risiko A"}]
[{"$f":"A11+1","v":3},null,"Kombination_von_Gefährdungen",{"$f":"VLOOKUP(C12,Legende!D6:E15,2,FALSE)","v":"J"},"Allgemeine Verletzungsgefahr","Allgemeine Verletzungen","S1","F1","P1",{"$f":"IF(AND(G12=\"S1\",H12=\"F1\",I12=\"P1\"),\"Risiko A\",IF(AND(G12=\"S1\",H12=\"F1\",I12=\"P2\"),\"Risiko B\",IF(AND(G12=\"S1\",H12=\"F2\",I12=\"P1\"),\"Risiko B\",IF(AND(G12=\"S1\",H12=\"F2\",I12=\"P2\"),\"Risiko C\",IF(AND(G12=\"S2\",H12=\"F1\",I12=\"P1\"),\"Risiko C\",IF(AND(G12=\"S2\",H12=\"F1\",I12=\"P2\"),\"Risiko D\",IF(AND(G12=\"S2\",H12=\"F2\",I12=\"P1\"),\"Risiko D\",IF(AND(G12=\"S2\",H12=\"F2\",I12=\"P2\"),\"Risiko E\",\"Pfad wählen\"))))))))","v":"Risiko A"},{"$nulls":3},"S1","F1","P1","Risiko A"]
[{"$f":"A12+1","v":4},null,"Elektrische_Gefährdung",{"$f":"VLOOKUP(C13,Legende!D6:E15,2,FALSE)","v":"B"},"spannungsführende Teile","Folgen von elektrischen Gefährdungen","S1","F1","P1",{"$f":"IF(AND(G13=\"S1\",H13=\"F1\",I13=\"P1\"),\"Risiko A\",IF(AND(G13=\"S1\",H13=\"F1\",I13=\"P2\"),\"Risiko B\",IF(AND(G13=\"S1\",H13=\"F2\",I13=\"P1\"),\"Risiko B\",IF(AND(G13=\"S1\",H13=\"F2\",I13=\"P2\"),\"Risiko C\",IF(AND(G13=\"S2\",H13=\"F1\",I13=\"P1\"),\"Risiko C\",IF(AND(G13=\"S2\",H13=\"F1\",I13=\"P2\"),\"Risiko D\",IF(AND(G13=\"S2\",H13=\"F2\",I13=\"P1\"),\"Risiko D\",IF(AND(G13=\"S2\",H13=\"F2\",I13=\"P2\"),\"Risiko E\",\"Pfad wählen\"))))))))","v":"Risiko A"},{"$nulls":3},"S1","F1","P1","Risiko A"]
[5,null,"Mechanische_Gefährdung",{"$f":"VLOOKUP(C14,[1]Legende!D5:E14,2,FALSE)","v":"A"},"Schwerkraft","Quetschen","S1","F1","P1",{"$f":"IF(AND(G14=\"S1\",H14=\"F1\",I14=\"P1\"),\"Risiko A\",IF(AND(G14=\"S1\",H14=\"F1\",I14=\"P2\"),\"Risiko B\",IF(AND(G14=\"S1\",H14=\"F2\",I14=\"P1\"),\"Risiko B\",IF(AND(G14=\"S1\",H14=\"F2\",I14=\"P2\"),\"Risiko C\",IF(AND(G14=\"S2\",H14=\"F1\",I14=\"P1\"),\"Risiko C\",IF(AND(G14=\"S2\",H14=\"F1\",I14=\"P2\"),\"Risiko D\",IF(AND(G14=\"S2\",H14=\"F2\",I14=\"P1\"),\"Risiko D\",IF(AND(G14=\"S2\",H14=\"F2\",I14=\"P2\"),\"Risiko E\",\"Pfad wählen\"))))))))","v":"Risiko A"},{"$nulls":3},"S1","F1","P1","Risiko A"]
[6,null,null,{"$f":"VLOOKUP(C15,Legende!D6:E15,2,FALSE)","v":{"$error":"#N/A"}},{"$nulls":5},"Pfad wählen",null," ",{"$nulls":4},"Pfad wählen"]
[7,null,null,{"$f":"VLOOKUP(C16,Legende!D6:E15,2,FALSE)","v":{"$error":"#N/A"}},{"$nulls":5},"Pfad wählen",{"$nulls":6},"Pfad wählen"]
[8,null,null,{"$f":"VLOOKUP(C17,Legende!D6:E15,2,FALSE)","v":{"$error":"#N/A"}},{"$nulls":5},"Pfad wählen",{"$nulls":6},"Pfad wählen"]
[9,null,null,{"$f":"VLOOKUP(C18,Legende!D6:E15,2,FALSE)","v":{"$error":"#N/A"}},{"$nulls":5},"Pfad wählen",{"$nulls":6},"Pfad wählen"]
[10,null,null,{"$f":"VLOOKUP(C19,Legende!D6:E15,2,FALSE)","v":{"$error":"#N/A"}},{"$nulls":5},"Pfad wählen",{"$nulls":6},"Pfad wählen"]
[11,null,null,{"$f":"VLOOKUP(C20,Legende!D6:E15,2,FALSE)","v":{"$error":"#N/A"}},{"$nulls":5},"Pfad wählen",{"$nulls":6},"Pfad wählen"]
[12,null,null,{"$f":"VLOOKUP(C21,Legende!D6:E15,2,FALSE)","v":{"$error":"#N/A"}},{"$nulls":5},"Pfad wählen",{"$nulls":6},"Pfad wählen"]
[13,null,null,{"$f":"VLOOKUP(C22,Legende!D6:E15,2,FALSE)","v":{"$error":"#N/A"}},{"$nulls":5},"Pfad wählen",{"$nulls":6},"Pfad wählen"]
[14,null,null,{"$f":"VLOOKUP(C23,Legende!D6:E15,2,FALSE)","v":{"$error":"#N/A"}},{"$nulls":5},"Pfad wählen",{"$nulls":6},"Pfad wählen"]
[15,null,null,{"$f":"VLOOKUP(C24,Legende!D6:E15,2,FALSE)","v":{"$error":"#N/A"}},{"$nulls":5},"Pfad wählen",{"$nulls":6},"Pfad wählen"]
[16,null,null,{"$f":"VLOOKUP(C25,Legende!D6:E15,2,FALSE)","v":{"$error":"#N/A"}},{"$nulls":5},"Pfad wählen",{"$nulls":6},"Pfad wählen"]
[17,null,null,{"$f":"VLOOKUP(C26,Legende!D6:E15,2,FALSE)","v":{"$error":"#N/A"}},{"$nulls":5},"Pfad wählen",{"$nulls":6},"Pfad wählen"]
[18,null,null,{"$f":"VLOOKUP(C27,Legende!D6:E15,2,FALSE)","v":{"$error":"#N/A"}},{"$nulls":5},"Pfad wählen",{"$nulls":6},"Pfad wählen"]
[19,null,null,{"$f":"VLOOKUP(C28,Legende!D6:E15,2,FALSE)","v":{"$error":"#N/A"}},{"$nulls":5},"Pfad wählen",{"$nulls":6},"Pfad wählen"]
[20,null,null,{"$f":"VLOOKUP(C29,Legende!D6:E15,2,FALSE)","v":{"$error":"#N/A"}},{"$nulls":5},"Pfad wählen",{"$nulls":6},"Pfad wählen"]
[21,null,null,{"$f":"VLOOKUP(C30,Legende!D6:E15,2,FALSE)","v":{"$error":"#N/A"}},{"$nulls":5},"Pfad wählen",{"$nulls":6},"Pfad wählen"]